program: Gaussian 09
title: 000286044
version: EM64L-G09RevD.01
frameworkgroup: C1[X(C24H28ClN3O)]
method: RPBEPBE
basis: SDD
operation: Freq
keyword: #p
keyword: freq=noraman
keyword: PBEPBE/SDD
title: #p freq=noraman PBEPBE/SDD
converged: NO YES NO NO
title: Mulliken charges:
elementType: Cl O N N N C C C C C C C C C C C C C C C C C C C C C C C C H H H H H H H H H H H H H H H H H H H H H H H H H H H H
charge: -0.051228 -0.233845 -0.133693 0.045992 -0.411120 0.510553 -0.498836 -0.500955 -0.490357 -0.494567 -0.412509 -0.416133 -0.464551 -0.486400 -0.386717 0.475801 -0.382081 -0.355550 -0.406543 -0.396850 0.470151 -0.397455 0.169769 0.272592 -0.343661 -0.348086 -0.207691 -0.220545 -0.093440 0.206666 0.195888 0.200063 0.201285 0.208934 0.222319 0.227571 0.203968 0.205627 0.198410 0.199286 0.197403 0.225376 0.211639 0.221143 0.235707 0.187710 0.206209 0.213158 0.220467 0.216303 0.276325 0.197893 0.281892 0.279834 0.229871 0.259842 0.257164
chargesum: 0.00000
title: Mulliken charges with hydrogens summed into heavy atoms:
elementType: Cl O N N N C C C C C C C C C C C C C C C C C C C C C C C C
charge: -0.051228 -0.233845 -0.133693 0.045992 -0.129228 0.510553 -0.096282 -0.099608 -0.059103 -0.063027 -0.008472 -0.019444 -0.027536 -0.029550 0.007202 0.475801 -0.168922 -0.135082 -0.190240 -0.120525 0.470151 -0.199562 0.169769 0.272592 -0.063827 -0.118215 0.052151 0.036619 -0.093440
polarizability: 7.02852508e+02 -2.98547859e+01 2.49793528e+02 -2.58125612e+01 -2.71368466e+01 1.86558349e+02
1716.lowfreq: -22.7359 -1.4437 -0.0014 0.0005 0.0020 2.0337 8.5838 14.0216 21.2607
frequency: -14.5555 12.7296 21.2221 25.5577 40.4999 51.2927 71.5948 79.4679 85.4172 107.6818 120.9580 137.4833 179.9682 189.4139 195.7666 222.5767 233.4449 261.3103 269.7390 277.0629 297.6998 306.6573 318.2134 340.6907 376.4133 386.8088 400.0358 408.5973 410.5602 417.1970 424.9095 427.1102 448.1571 456.0673 465.7111 485.0827 493.3750 512.8003 522.1601 540.2999 570.3851 601.5940 611.9687 625.1220 634.2804 669.9835 671.0064 705.8006 709.3087 733.9418 737.0360 781.2834 793.8029 803.1374 815.2143 822.0207 824.7602 829.3806 843.7092 849.9120 871.1196 895.7507 899.8026 919.9588 923.3992 926.7348 928.5542 949.6206 952.3850 982.3134 982.7792 983.8704 993.3907 998.6658 999.5879 1003.2134 1017.4366 1020.7206 1028.3441 1058.5503 1073.0871 1089.1516 1100.6001 1107.0939 1108.3158 1121.2334 1126.6395 1135.9456 1148.5771 1171.4628 1184.2257 1185.3097 1194.9198 1200.4631 1233.1067 1239.3476 1242.9175 1251.6226 1256.1027 1265.8462 1275.5789 1292.9684 1304.3662 1313.9046 1320.0717 1324.4682 1333.4475 1335.9075 1338.1788 1338.8506 1343.5567 1352.3602 1357.4523 1362.8595 1365.7956 1370.7234 1392.8772 1407.4035 1447.0032 1448.1973 1454.2443 1463.9025 1464.6498 1470.6904 1472.9747 1477.1983 1482.8574 1486.4956 1499.4720 1504.5719 1524.6970 1543.3386 1571.6136 1582.3113 1596.1230 1614.5791 1629.3795 2941.5335 2950.9270 2961.9938 2964.8426 2967.0583 2972.4649 2974.4158 2977.4316 2978.9896 2985.8237 3010.9867 3023.2286 3026.8543 3028.8362 3030.2049 3039.6694 3045.4036 3091.3532 3102.6296 3111.3207 3126.6893 3145.5697 3156.8889 3159.8665 3167.7511 3169.8996 3176.5387 3377.7885
redmass: 4.8209 7.0930 5.3612 5.8797 3.8543 4.9151 4.8544 4.3207 7.3580 5.5639 4.8484 3.2231 4.7234 4.4780 5.6650 2.7647 4.1538 3.4274 2.5022 4.5113 4.2058 5.8213 3.7124 2.1850 2.9444 2.5173 2.1765 2.9016 2.9810 3.4055 4.9046 2.8241 2.3371 3.2083 3.6861 4.1765 3.1155 4.5492 2.2685 2.1982 3.2804 2.2227 1.6365 3.2538 6.5872 4.7599 3.0717 4.8483 6.6136 3.5280 3.5142 1.4708 1.5571 1.3935 2.1666 1.9179 1.5735 2.7064 1.8581 1.5153 2.4238 5.2721 2.5456 1.9219 1.4432 1.5080 2.4364 1.3740 1.4659 2.1751 1.3932 1.3825 2.8733 3.5046 2.0117 1.6897 2.3899 6.6845 1.9638 1.9021 2.7519 1.5761 1.7000 1.8596 1.4833 2.4480 2.6132 1.5294 1.8378 1.5429 1.1367 1.5180 1.6239 1.1513 1.4753 2.8730 1.4969 1.4103 1.5714 1.3059 1.3362 1.2583 1.4796 1.4760 1.4138 1.4002 1.4536 1.6984 1.4189 1.3948 1.4991 1.4848 1.4298 1.3245 4.2701 3.7450 3.9617 2.3957 1.5234 2.0039 1.0885 1.0869 1.0911 2.2880 1.0845 1.0860 1.0885 1.0911 1.1034 1.8422 3.1691 6.4790 7.6992 5.4504 6.2009 8.0202 6.4085 1.0861 1.0607 1.0627 1.0627 1.0604 1.0633 1.0633 1.0666 1.0712 1.0671 1.0979 1.0954 1.0950 1.1007 1.1011 1.1020 1.1000 1.0918 1.0919 1.0891 1.0896 1.0872 1.0887 1.0923 1.0955 1.0953 1.0973 1.0750
irintensity: 0.3227 1.2226 0.1462 0.3230 0.5721 1.2627 0.3499 1.8203 8.7022 0.4857 0.1293 0.5383 3.4809 1.2762 10.6780 4.9404 12.6805 6.3522 0.1324 11.2158 0.9931 3.4190 8.9126 1.0830 1.8228 2.1514 2.5129 0.7959 1.5536 6.8607 0.5875 0.5057 16.4133 1.1016 13.1352 5.1631 6.3506 23.9886 23.9403 9.0027 2.2004 13.0799 59.2842 14.6085 0.6955 17.8645 1.6558 2.9672 7.0046 1.4880 17.8625 0.7082 2.3136 8.2068 0.9420 38.7629 22.5444 22.1584 9.8523 38.3553 2.6910 76.0843 1.2049 14.8039 21.1522 12.0193 54.0400 0.3413 14.9111 41.7318 2.2135 4.5955 7.2091 21.4624 28.6639 30.7277 12.0171 29.2219 16.8469 1.5049 54.1551 15.1843 17.6836 34.0879 58.1862 31.2901 68.8059 5.6821 1.5771 18.3287 39.0353 36.2812 10.1143 129.9007 188.6623 199.2187 98.3051 6.4683 24.5377 1.1630 3.9008 2.4486 4.2322 3.0342 9.8097 2.1905 11.9666 14.0241 4.3501 23.9782 4.9346 12.3451 4.4780 24.6071 19.8809 18.7649 5.9023 141.8259 9.3333 24.0187 2.3290 9.5940 10.4758 169.5337 31.0426 1.8613 17.7053 4.9412 29.2045 393.3095 186.3952 34.4302 89.8959 131.3833 82.3514 295.2509 551.4077 75.7965 21.6071 20.8699 41.9310 50.4012 24.6194 25.5203 32.5120 42.6147 67.7718 40.9306 77.2987 83.5077 83.5083 16.1716 128.1330 96.4764 19.2588 21.5112 11.6131 16.6715 7.4729 0.3024 30.8381 20.6735 3.7453 4.0063 35.8427
temp: 298.150 k
press: 1.00000 atm
elementType: 17 8 7 7 7 6 6 6 6 6 6 6 6 6 6 6 6 6 6 6 6 6 6 6 6 6 6 6 6 1 1 1 1 1 1 1 1 1 1 1 1 1 1 1 1 1 1 1 1 1 1 1 1 1 1 1 1
symmnumber: 1
zpe: 1237893.2 jmol-1
zpe.correction: 0.471489 hartree
zpe.thermalcorrener: 0.496770 hartree
zpe.thermalcorrenthalpy: 0.497714 hartree
zpe.thermalcorrgfe: 0.414147 hartree
zpe.sumelectzpe: -1628.752219 hartree
zpe.sumelectthermal: -1628.726938 hartree
zpe.sumelectthermalent: -1628.725993 hartree
zpe.sumelectthermalfe: -1628.809560 hartree
dipole: 6.8270 -3.4521 2.3895
dipole: 8.0146
quadrupole: -167.6037 -172.9975 -183.5428
quadrupole: 10.9360 -9.5474 -2.7930
quadrupole: 7.1110 1.7172 -8.8281 10.9360 -9.5474 -2.7930
hfenergy: -1629.2237072 hartree
pointgroup: C01 [X(C24H28Cl1N3O1)]
dipole: -2.6735311 -1.5271716 -0.6801633 debye
polarizability: 697.7130633|40.3072945|256.7593419|-50.4426527|17.283239|184.7319796 unknown
InChI: InChI=1S/C24H28ClN3O/c25-21-8-6-20(7-9-21)23(29)27-26-18-19-4-10-22(11-5-19)28-16-14-24(15-17-28)12-2-1-3-13-24/h4-11,18,27H,1-3,12-17H2
charge 0 multiplicity 1
57 atoms
Cl 10.744098 0.037137 -1.305733
O  4.538058 2.080147 0.763175
N  -3.790103 -1.011793 1.12346
N  2.62898 0.056234 0.312306
N  3.966322 -0.052492 -0.04386
C  -6.255691 0.358241 0.100014
C  -6.746529 1.416562 -0.934825
C  -7.487754 -0.126196 0.931299
C  -5.553774 -0.829347 -0.633406
C  -5.208558 1.040148 1.037347
C  -7.920256 0.931434 -1.817798
C  -8.673406 -0.615139 0.063865
C  -4.775115 -1.771521 0.323527
C  -4.460838 0.025098 1.935063
C  -9.113786 0.465587 -0.951162
C  -2.423364 -0.973872 0.815311
C  -1.791582 -2.031579 0.08147
C  -1.580836 0.10917 1.246049
C  -0.41706 -2.002578 -0.196473
C  -0.209706 0.125823 0.966736
C  0.410968 -0.929191 0.23563
C  1.834478 -0.926357 -0.076281
C  4.872737 0.977931 0.246036
C  6.299264 0.67691 -0.14501
C  7.149291 1.787665 -0.383782
C  6.837997 -0.634014 -0.238957
C  8.500118 1.603774 -0.740668
C  8.190987 -0.835676 -0.590458
C  8.998639 0.28943 -0.845215
H  -5.893278 1.72907 -1.570429
H  -7.07462 2.320511 -0.377927
H  -7.835603 0.72566 1.553122
H  -7.196824 -0.92651 1.639699
H  -6.290145 -1.428956 -1.201103
H  -4.835697 -0.419329 -1.372103
H  -4.463738 1.580884 0.418521
H  -5.716651 1.794263 1.671739
H  -7.589011 0.097851 -2.469658
H  -8.236551 1.749111 -2.49421
H  -9.521105 -0.889487 0.721633
H  -8.392238 -1.538059 -0.482638
H  -5.477137 -2.277195 1.016588
H  -4.277678 -2.559495 -0.260036
H  -3.7363 0.529351 2.59183
H  -5.183375 -0.486367 2.602454
H  -9.520884 1.337479 -0.397561
H  -9.930882 0.082098 -1.59233
H  -2.370422 -2.897004 -0.252964
H  -2.006619 0.959437 1.785981
H  0.028124 -2.836728 -0.754819
H  0.41139 0.965512 1.296076
H  2.214133 -1.792791 -0.660619
H  4.291152 -0.860809 -0.596072
H  6.730311 2.792776 -0.273035
H  6.229497 -1.513176 0.003921
H  9.152218 2.460721 -0.931347
H  8.610453 -1.843853 -0.652272
