program: Gaussian 09
title: 000024048
version: EM64L-G09RevD.01
frameworkgroup: C1[X(C5H7N3O2)]
method: RPBEPBE
basis: SDD
operation: Freq
keyword: #pfreq=noraman
keyword: PBEPBE/SDD
title: #p freq=noraman PBEPBE/SDD
converged: YES YES NO YES
title: Mulliken charges:
elementType: O O N N N C C C C C H H H H H H H
charge: -0.239247 -0.184478 -0.163046 -0.013780 0.070008 0.361587 -0.017276 -0.213218 -0.752768 -0.632003 0.265914 0.222559 0.272055 0.272189 0.254333 0.254321 0.242849
chargesum: 0.00000
title: Mulliken charges with hydrogens summed into heavy atoms:
elementType: O O N N N C C C C C
charge: -0.239247 -0.184478 -0.163046 -0.013780 0.070008 0.361587 -0.017276 0.052696 0.014036 0.119499
polarizability: 1.14403353e+02 -1.16920632e+00 9.36023682e+01 3.05103489e-03 8.02965014e-03 4.27608617e+01
1716.lowfreq: -9.6442 -2.2768 -0.0010 -0.0009 -0.0009 7.1107 48.4992 93.0029 117.0851
frequency: 48.3543 92.9327 117.0846 134.5074 193.3527 260.2487 270.6554 286.3699 367.4518 407.0058 541.1980 625.4389 635.7184 646.7237 713.9315 726.9278 762.4720 784.4420 921.0619 1030.8504 1035.7568 1073.7921 1120.6806 1171.9274 1178.6812 1253.1150 1289.1479 1324.1172 1359.0414 1380.2428 1413.3912 1424.7035 1446.8724 1460.6863 1474.3353 1485.1813 1487.6811 1538.9812 3000.0716 3003.4722 3081.7328 3094.3457 3103.2264 3119.8317 3237.8722
redmass: 3.0422 1.3221 3.7947 1.0369 6.0051 3.7607 4.7616 2.6087 5.4150 7.2908 5.0467 6.8726 3.7259 5.1121 5.5082 9.4645 10.0791 1.4221 2.6385 1.7962 1.4569 2.4057 1.3307 2.8666 4.9956 2.0423 6.0985 6.1747 9.4124 5.1779 1.2275 1.9146 1.0419 1.2070 1.0410 1.3837 1.3496 6.3101 1.0367 1.0343 1.0966 1.1028 1.1005 1.1007 1.0991
irintensity: 0.2919 1.0081 0.0620 0.1025 1.2069 0.7057 1.2702 0.8940 0.4232 1.1707 0.1945 1.8714 15.9070 0.0378 2.5023 2.5068 38.9748 24.7794 19.0706 11.6270 4.7630 1.9514 0.4637 16.8030 118.5567 41.5952 25.1568 52.0533 192.8338 26.5262 10.7600 13.5727 20.3862 14.5005 10.3375 66.0662 5.2994 34.5120 7.3575 34.6805 2.9941 15.1724 21.2797 9.5357 0.3800
temp: 298.150 k
press: 1.00000 atm
elementType: 8 8 7 7 7 6 6 6 6 6 1 1 1 1 1 1 1
symmnumber: 1
zpe: 329724.4 jmol-1
zpe.correction: 0.125585 hartree
zpe.thermalcorrener: 0.135264 hartree
zpe.thermalcorrenthalpy: 0.136208 hartree
zpe.thermalcorrgfe: 0.090027 hartree
zpe.sumelectzpe: -508.589707 hartree
zpe.sumelectthermal: -508.580029 hartree
zpe.sumelectthermalent: -508.579085 hartree
zpe.sumelectthermalfe: -508.625266 hartree
dipole: -8.9451 2.1570 -0.0007
dipole: 9.2015
quadrupole: -58.3693 -60.3639 -57.3780
quadrupole: 2.1553 -0.0004 -0.0020
quadrupole: 0.3344 -1.6601 1.3258 2.1553 -0.0004 -0.0020
hfenergy: -508.7152928 hartree
pointgroup: C01 [X(C5H7N3O2)]
dipole: -3.5193525 0.8483633 -0.0002827 debye
dipolederiv: -0.6090834 -0.1103729 -0.0000392 -0.2125102 -0.7817913 -0.000202 -0.0001047 -0.0001889 -0.2476019 -0.8082304 0.2721708 0.0001111 0.2323988 -0.576748 -0.0001728 0.0000628 -0.0001183 -0.2149952 -0.7139664 0.1039613 -0.0000605 -0.1597384 -0.2610628 0.0000316 0.0001727 -0.0000477 -0.1100258 -0.2933553 0.0782538 -0.0000774 0.2060567 -0.3123232 0.000021 0.0001089 0.0000049 -0.2000562 1.8072429 -0.1205534 -0.0000245 0.0904044 1.135243 0.0004504 0.0000138 0.0003612 0.1921413 0.6771573 -0.0479483 -0.0000144 -0.0827675 0.2157189 0.0000443 -0.0003107 0.00037 0.0571091 -0.7865586 0.1309737 -0.0000116 0.0521702 0.020535 -0.0000311 -0.0000912 -0.0000237 0.0032564 0.067022 -0.1987324 0.0000208 -0.1318952 0.3071376 -0.0001046 -0.0000343 -0.0000408 -0.1001062 0.141031 -0.0866473 0.0002379 0.0302255 -0.1758219 0.0000508 0.0006367 -0.0003716 0.0292645 0.4708071 -0.0780899 0.0000495 -0.0979038 0.1523243 -0.0000156 -0.000032 -0.000008 0.2108523 0.0119039 -0.0586092 0.0000069 -0.0397 0.0695119 0.000017 -0.0000286 -0.0000003 0.1894242 -0.1263869 0.1284122 -0.0004838 0.0469099 0.0525267 0.0000147 -0.0004992 0.0002144 0.1103008 0.0547305 -0.0161271 -0.0704759 0.0080399 0.059196 -0.0264177 -0.0535221 -0.0557086 0.0068702 0.054362 -0.016495 0.070761 0.007882 0.0596096 0.0262901 0.0536203 0.0555338 0.0075653 0.0117891 0.0228338 -0.0125368 0.0924838 0.0388614 -0.0940682 0.0514029 -0.0922885 -0.0316271 0.0117681 0.0228175 0.0125357 0.0924303 0.0389477 0.0940492 -0.0514256 0.0922614 -0.0317387 0.0297669 -0.0258477 0.0000012 -0.1344866 -0.0418648 0.0000428 0.0000301 0.0000509 0.1293671 unknown
polarizability: 114.4035248|-1.1676744|93.6021961|0.0030504|0.0080299|42.7608617 unknown
InChI: InChI=1S/C5H7N3O2/c1-4-5(8(9)10)6-3-7(4)2/h3H,1-2H3
charge 0 multiplicity 1
17 atoms
O  2.166832 1.353149 0.000674
O  2.782207 -0.851824 -0.000149
N  -1.714469 -0.193783 -0.000037
N  0.065499 -1.610036 0.000035
N  1.892895 0.07665 0.000117
C  -0.58641 0.631799 -0.000048
C  0.490764 -0.282555 0.000042
C  -1.270733 -1.526918 0.000113
C  -0.639207 2.128034 -0.000027
C  -3.11913 0.24095 -0.00033
H  -1.956508 -2.371041 0.000206
H  -1.67542 2.505575 -0.00205
H  -0.110633 2.533246 0.88001
H  -0.107056 2.533276 -0.877851
H  -3.346751 0.839037 0.898266
H  -3.346565 0.838471 -0.899353
H  -3.764812 -0.65103 -0.000119
