program: Gaussian 09
title: 000286020
version: EM64L-G09RevD.01
frameworkgroup: C1[X(C15H16N4O5)]
method: RPBEPBE
basis: SDD
operation: Freq
keyword: #p
keyword: freq=noraman
keyword: PBEPBE/SDD
title: #p freq=noraman PBEPBE/SDD
converged: YES YES NO NO
title: Mulliken charges:
elementType: O O O O O N N N N C C C C C C C C C C C C C C C H H H H H H H H H H H H H H H H
charge: -0.224792 -0.449151 -0.377336 -0.343732 -0.252773 -0.398778 -0.116892 -0.003047 -0.619481 -0.168527 -0.375110 0.063064 0.261265 0.200605 0.161317 0.392919 -0.378135 -0.369783 0.018940 -0.388328 -0.395743 -0.218187 -0.226348 -0.240533 0.292936 0.334564 0.213745 0.244419 0.236505 0.242393 0.228345 0.274877 0.227157 0.372892 0.226990 0.225603 0.227999 0.390596 0.323867 0.385680
chargesum: 0.00000
title: Mulliken charges with hydrogens summed into heavy atoms:
elementType: O O O O O N N N N C C C C C C C C C C C C C C C
charge: -0.224792 -0.076260 0.008344 -0.343732 -0.252773 -0.064214 -0.116892 -0.003047 0.094982 0.124409 0.083054 0.063064 0.261265 0.200605 0.161317 0.392919 0.100764 -0.141438 0.018940 -0.113451 -0.168586 0.008803 -0.000745 -0.012535
polarizability: 3.40290315e+02 -6.02554472e-01 2.11872489e+02 3.61063812e+00 -4.48117203e+00 1.14117599e+02
1716.lowfreq: -9.1047 -4.2131 -0.8374 -0.0008 -0.0007 0.0009 6.4304 12.2370 20.9629
frequency: 2.6586 12.0231 20.9431 28.2356 37.0333 45.5991 59.2931 81.6218 95.6715 132.1547 145.0506 159.9157 185.6752 203.0651 218.4702 225.9831 246.4648 284.9482 323.0773 330.9803 341.8815 368.8772 401.4891 404.3605 429.9442 434.5887 464.8693 531.1598 546.2440 560.7615 568.5129 578.8119 584.4237 616.7962 619.9051 661.3692 661.8856 679.0909 694.0889 702.6835 720.9144 727.9278 738.5884 761.1425 780.0363 782.8187 815.3642 827.4494 856.2631 870.1673 902.7103 908.1252 916.6082 919.1375 971.7403 975.8672 979.7555 989.5938 991.1810 1006.0889 1028.0555 1034.2737 1057.5209 1081.1447 1084.5651 1108.0810 1140.8452 1172.3321 1187.9449 1196.9620 1197.5519 1218.5404 1235.9578 1260.4305 1275.0054 1290.1577 1313.7385 1323.4689 1327.9852 1344.2240 1347.8089 1359.5597 1382.9082 1388.5783 1407.4441 1434.2095 1441.2158 1459.9412 1463.1424 1465.2692 1486.6954 1491.0517 1543.1235 1587.6453 1595.5090 1600.8293 1619.2923 1625.9256 2988.1055 2995.1663 3047.1732 3052.8157 3101.8628 3112.5103 3120.7364 3127.6684 3141.4167 3158.8334 3173.9726 3333.8123 3478.8274 3495.1866 3522.6751 3629.8178
redmass: 4.2839 6.5763 5.6156 7.9525 5.9050 6.6396 5.5413 6.5676 7.6656 6.3403 5.0698 4.9882 4.3426 3.8891 5.4298 4.8839 5.3669 4.9910 5.7910 6.5695 5.0071 4.0479 2.8763 5.6921 5.2811 2.9455 2.9914 3.6112 4.4769 5.1263 1.2694 2.9459 1.4398 6.3672 1.3389 1.7051 3.7045 7.1351 3.8805 2.2756 4.3041 7.7446 1.4387 6.4243 4.8892 3.0430 4.1572 1.4139 1.2505 4.2274 3.0722 1.3551 2.8063 1.8779 2.4290 5.9174 1.4246 5.2247 1.5788 1.5294 2.1669 3.4459 2.7826 2.1093 1.5892 2.7560 2.2280 1.0526 1.1135 1.3976 1.1352 2.0056 1.7518 2.3051 2.0101 3.0865 1.5900 3.6084 1.7677 1.5326 1.5989 1.6605 6.0634 1.3278 2.7806 2.3739 2.1905 1.1243 1.9050 1.5936 2.3239 2.0889 5.6444 2.2566 6.0954 4.1797 6.0273 7.6705 1.0580 1.0666 1.1040 1.0838 1.0994 1.0875 1.0910 1.0869 1.0930 1.0980 1.0972 1.0592 1.0652 1.0640 1.0770 1.0925
irintensity: 0.3179 1.0562 1.3908 0.6186 0.4068 0.3990 1.3750 2.4805 1.4424 6.3191 6.0876 8.1924 12.3340 1.3250 0.9714 1.8570 0.3200 2.1438 15.2741 5.1325 11.9238 11.0294 0.4011 4.7687 13.6165 5.4518 10.1206 41.3149 21.9165 9.2627 124.5562 73.1910 147.0346 0.0987 133.8458 125.4198 95.0901 10.1293 49.4584 26.5130 34.7813 0.1625 85.8567 3.8957 2.5184 0.7481 5.5262 143.8902 0.1820 13.9394 21.8476 4.7918 21.4081 16.3600 40.9664 87.4963 3.1603 0.1797 1.8336 2.6984 10.7879 68.1753 60.1879 157.9739 7.7155 50.7521 10.5869 0.4408 18.0169 79.7398 1.6227 8.1771 141.6635 551.3784 300.3583 28.4599 7.0483 7.8529 1.7274 87.2366 74.4326 76.4035 105.7522 41.0512 425.0348 96.6884 43.7708 7.9639 13.7567 3.1143 32.3615 227.1636 522.0229 153.5369 4.5517 653.6353 4.2630 216.3737 11.5133 59.3277 15.1813 26.0641 16.7399 9.7656 24.7308 1.2133 31.1549 35.5483 7.3705 211.4827 51.8048 20.1863 50.1266 88.7366
temp: 298.150 k
press: 1.00000 atm
elementType: 8 8 8 8 8 7 7 7 7 6 6 6 6 6 6 6 6 6 6 6 6 6 6 6 1 1 1 1 1 1 1 1 1 1 1 1 1 1 1 1
symmnumber: 1
zpe: 796662.7 jmol-1
zpe.correction: 0.303433 hartree
zpe.thermalcorrener: 0.325667 hartree
zpe.thermalcorrenthalpy: 0.326612 hartree
zpe.thermalcorrgfe: 0.245249 hartree
zpe.sumelectzpe: -1174.599397 hartree
zpe.sumelectthermal: -1174.577162 hartree
zpe.sumelectthermalent: -1174.576218 hartree
zpe.sumelectthermalfe: -1174.657580 hartree
dipole: -1.7369 3.3451 0.1308
dipole: 3.7714
quadrupole: -115.1515 -139.0149 -137.7559
quadrupole: 0.8619 -6.0480 0.0834
quadrupole: 15.4892 -8.3741 -7.1152 0.8619 -6.0480 0.0834
hfenergy: -1174.9028295 hartree
pointgroup: C01 [X(C15H16N4O5)]
dipole: -0.6821974 -1.2998233 -0.2161794 debye
polarizability: 340.3475929|0.6681613|211.576022|0.2712121|6.9937735|114.3567883 unknown
InChI: InChI=1S/C15H16N4O5/c16-12-10(13(21)18-11(7-20)14(22)23)6-17-15(19-12)24-8-9-4-2-1-3-5-9/h1-6,11,18,20,22H,7-8,16H2
charge 0 multiplicity 1
40 atoms
O  2.624899 0.327541 -0.081026
O  -5.375019 2.203503 1.245402
O  -5.78421 -0.81897 -1.872065
O  -3.235954 -2.131315 0.2882
O  -6.418323 1.319962 -1.246202
N  -3.72857 0.130849 0.245008
N  0.966164 -1.321436 0.12652
N  0.445178 1.053146 -0.137129
N  -0.707061 -2.93867 0.33211
C  -5.17292 -0.101222 0.367847
C  -5.745943 0.802466 1.48298
C  -1.377339 -0.581635 0.120211
C  -2.818359 -0.916004 0.218198
C  -5.858929 0.227255 -0.969609
C  -0.374911 -1.626865 0.194504
C  5.003043 -0.14462 0.064658
C  3.619217 -0.764346 0.063781
C  -0.871278 0.731904 -0.06182
C  1.296141 -0.018453 -0.023158
C  5.210403 1.221638 0.372196
C  6.12167 -0.971529 -0.209018
C  6.521042 1.749604 0.410701
C  7.431209 -0.444358 -0.163451
C  7.635237 0.920188 0.147845
H  -5.314109 -1.174468 0.586657
H  -3.438617 1.107284 0.348113
H  -6.845251 0.680442 1.55278
H  -5.286866 0.532474 2.446916
H  3.488961 -1.484349 -0.76515
H  3.406114 -1.303656 1.007029
H  -1.547229 1.58923 -0.168001
H  4.344379 1.862256 0.561126
H  5.971176 -2.029456 -0.460376
H  -5.872353 2.497687 0.433421
H  6.670865 2.809786 0.644195
H  8.287688 -1.093598 -0.377348
H  8.650095 1.332243 0.178994
H  -1.714025 -3.16531 0.355666
H  0.039775 -3.629565 0.378383
H  -6.192292 -0.553635 -2.742184
