program: Gaussian 09
title: 000286018
version: EM64L-G09RevD.01
frameworkgroup: C1[X(C14H14N4O4)]
method: RPBEPBE
basis: SDD
operation: Freq
keyword: #p
keyword: freq=noraman
keyword: PBEPBE/SDD
title: #p freq=noraman PBEPBE/SDD
converged: YES YES NO NO
title: Mulliken charges:
elementType: O O O O N N N N C C C C C C C C C C C C C C H H H H H H H H H H H H H H
charge: -0.228760 -0.256791 -0.390082 -0.267707 -0.392141 -0.127548 -0.007130 -0.662447 0.376221 -0.370710 0.094989 0.129317 -0.380589 -0.397582 0.166078 0.030603 -0.370541 -0.451620 -0.228014 -0.217710 -0.240867 0.231577 0.240619 0.234551 0.224840 0.281799 0.276404 0.329464 0.274599 0.305422 0.224699 0.226931 0.227438 0.327504 0.395920 0.391266
chargesum: 0.00000
title: Mulliken charges with hydrogens summed into heavy atoms:
elementType: O O O O N N N N C C C C C C C C C C C C C C
charge: -0.228760 -0.256791 0.001184 -0.267707 -0.062677 -0.127548 -0.007130 0.060977 0.376221 0.104460 0.094989 0.129317 -0.155750 -0.115783 0.166078 0.030603 -0.094138 0.128402 -0.003315 0.009220 -0.013429 0.231577
polarizability: 3.18546851e+02 -3.21815747e-01 1.91633273e+02 3.27137694e+00 -6.98065891e+00 9.40467468e+01
1716.lowfreq: -7.4996 -0.7709 0.0006 0.0007 0.0008 4.1959 8.9503 19.9450 41.0007
frequency: -3.0169 19.8469 40.9881 46.7014 56.5847 71.8344 78.5888 89.1121 131.4865 154.0386 176.6623 196.5730 204.2977 230.2668 251.7868 278.7675 311.9648 346.6865 378.7904 401.5338 437.3791 451.3868 461.6196 480.8631 493.5056 530.2971 554.5349 561.4572 570.0019 608.4208 616.3049 621.4899 643.8412 664.3928 690.5538 702.6573 727.7892 738.4003 761.8732 779.0052 788.5448 813.3709 813.8218 849.0100 857.6688 909.2071 914.9955 947.5538 968.0807 980.6737 989.4150 993.0285 1004.0586 1009.8189 1028.7876 1051.9759 1071.1516 1084.8868 1090.8843 1165.7419 1172.2734 1188.0671 1199.0295 1215.1887 1218.0692 1241.4838 1265.6286 1274.0848 1295.5808 1313.4007 1317.8408 1341.6056 1362.5900 1382.0044 1403.6662 1424.4790 1431.7499 1441.1015 1464.7042 1481.0959 1487.4002 1529.4314 1555.5871 1595.6286 1604.1968 1620.3119 1638.8003 1648.1534 2985.4143 3005.9467 3041.1162 3063.8471 3110.5030 3127.4936 3141.1042 3152.2344 3159.0157 3176.9158 3399.7150 3515.4626 3541.9728 3616.2876
redmass: 4.2022 5.3625 6.5646 6.8962 4.6486 7.5159 7.3538 8.1118 4.5610 5.6686 5.7787 3.9901 3.8978 8.3709 5.5762 3.8625 5.8095 6.5608 4.9134 2.8475 4.7573 3.4947 2.8463 2.7840 2.2884 1.4428 6.7869 4.7290 4.1454 1.2660 5.9446 4.5168 1.4803 7.0535 7.6892 2.3772 9.7619 1.3463 6.7377 4.9032 5.1059 2.2508 1.5672 4.0799 1.2504 1.3177 4.4491 1.4883 6.1495 1.3840 6.1042 1.5014 2.9488 1.5431 2.1625 3.3428 2.4196 1.6116 2.4737 3.5769 1.0521 1.1136 1.1201 2.0035 1.2226 2.6376 4.4711 1.6632 2.0921 1.5816 3.6085 1.6498 1.9972 6.8783 3.2266 4.3992 1.1030 2.2352 1.1289 2.0210 2.3314 5.4552 5.7992 6.1870 6.1855 6.0015 2.3223 2.0063 1.0571 1.0602 1.1046 1.1004 1.0876 1.0869 1.0931 1.0932 1.0985 1.0964 1.0582 1.0643 1.0782 1.0942
irintensity: 0.9503 0.4678 0.4185 0.3843 1.3705 3.3675 1.0463 3.0460 7.8930 6.3497 3.5747 2.6371 3.1825 0.7247 4.8378 13.8193 1.0016 8.9219 2.2868 0.1508 18.6149 17.2490 16.6269 36.8408 34.3079 79.6497 12.3842 25.8417 19.7564 155.2475 7.4287 23.1941 150.8309 17.6673 5.9979 25.6563 9.3075 86.9976 7.3360 9.9132 13.0165 29.3677 68.5125 9.0476 0.1973 2.1450 10.5938 13.9885 88.7272 0.1196 0.6126 1.3782 42.8419 2.8933 10.8639 102.0843 259.0334 12.4121 37.9145 3.1117 0.3761 13.5494 0.5027 8.4292 3.9414 400.0373 425.5217 15.5067 8.0431 26.9488 69.2738 87.5989 106.7907 121.1924 346.6350 18.7346 54.4005 20.2468 4.0916 142.4082 23.1065 172.6281 643.3481 2.6661 239.3989 6.1830 245.3924 202.6094 11.5461 47.8053 16.1702 3.7086 10.5160 1.4673 32.5707 3.2502 34.7924 6.3585 463.6813 37.9293 18.5991 95.3903
temp: 298.150 k
press: 1.00000 atm
elementType: 8 8 8 8 7 7 7 7 6 6 6 6 6 6 6 6 6 6 6 6 6 6 1 1 1 1 1 1 1 1 1 1 1 1 1 1
symmnumber: 1
zpe: 712048.1 jmol-1
zpe.correction: 0.271205 hartree
zpe.thermalcorrener: 0.290142 hartree
zpe.thermalcorrenthalpy: 0.291086 hartree
zpe.thermalcorrgfe: 0.221933 hartree
zpe.sumelectzpe: -1060.234827 hartree
zpe.sumelectthermal: -1060.215891 hartree
zpe.sumelectthermalent: -1060.214946 hartree
zpe.sumelectthermalfe: -1060.284099 hartree
dipole: 3.9025 -6.1916 1.6651
dipole: 7.5059
quadrupole: -96.9121 -127.0698 -129.0229
quadrupole: -12.4575 5.9690 1.9029
quadrupole: 20.7562 -9.4015 -11.3546 -12.4575 5.9690 1.9029
hfenergy: -1060.5060322 hartree
pointgroup: C01 [X(C14H14N4O4)]
dipole: -1.5006668 -1.8977549 -1.6932148 debye
polarizability: 318.500267|0.176582|166.2566795|4.1718925|43.4029389|119.4699242 unknown
InChI: InChI=1S/C14H14N4O4/c15-12-10(13(21)16-7-11(19)20)6-17-14(18-12)22-8-9-4-2-1-3-5-9/h1-6,16,19H,7-8,15H2
charge 0 multiplicity 1
36 atoms
O  2.217037 0.595771 0.29515
O  -3.933644 1.556605 1.497145
O  -7.134074 -1.444628 -0.460884
O  -4.903838 -2.077499 -0.352502
N  -4.062761 0.560342 -0.604571
N  0.144965 -0.425145 -0.131684
N  0.343314 1.761171 0.945271
N  -1.89763 -1.471368 -0.519617
C  4.350164 -0.463337 -0.187112
C  2.843329 -0.613984 -0.284725
C  -1.870686 0.832211 0.427544
C  -1.227958 -0.351188 -0.082833
C  5.16976 -1.395074 -0.87387
C  4.957179 0.555903 0.584417
C  -3.34612 1.018458 0.508885
C  0.843187 0.628499 0.358586
C  -1.014173 1.824757 0.965235
C  -5.492652 0.321461 -0.530544
C  6.576505 -1.314874 -0.784613
C  6.36642 0.63757 0.669247
C  7.18072 -0.296103 -0.010787
C  -5.774941 -1.178117 -0.436908
H  2.481006 -1.499011 0.273142
H  2.509416 -0.72611 -1.333447
H  4.709352 -2.185577 -1.481044
H  4.322176 1.279612 1.102537
H  -1.45573 2.712978 1.429217
H  -3.545593 0.230115 -1.421821
H  -6.048007 0.742283 -1.387952
H  -5.868605 0.821559 0.382589
H  7.198785 -2.041029 -1.319805
H  6.82662 1.432537 1.26696
H  8.272407 -0.230324 0.057424
H  -1.314624 -2.259212 -0.801754
H  -2.902744 -1.626416 -0.367771
H  -7.299961 -2.423139 -0.380406
