program: Gaussian 09
title: 000286047
version: EM64L-G09RevD.01
frameworkgroup: C1[X(C23H28BrN3)]
method: RPBEPBE
basis: SDD
operation: Freq
keyword: #p
keyword: freq=noraman
keyword: PBEPBE/SDD
title: #p freq=noraman PBEPBE/SDD
converged: YES YES NO NO
title: Mulliken charges:
elementType: Br N N N C C C C C C C C C C C C C C C C C C C C C C C H H H H H H H H H H H H H H H H H H H H H H H H H H H H
charge: -0.015375 -0.141122 -0.002341 -0.439313 0.484393 -0.504898 -0.484967 -0.510982 -0.515346 -0.417506 -0.418407 -0.425760 -0.433446 -0.386475 0.468298 -0.369188 -0.353314 -0.425326 -0.415176 0.474571 -0.420283 0.486394 -0.415954 -0.364633 -0.147453 -0.143166 -0.244813 0.195155 0.220413 0.200216 0.196101 0.208054 0.208871 0.209950 0.210923 0.197376 0.199539 0.197871 0.204039 0.214339 0.224024 0.218252 0.216644 0.187533 0.205625 0.225412 0.222710 0.214895 0.253988 0.198126 0.267767 0.222331 0.274507 0.243686 0.243241
chargesum: 0.00000
title: Mulliken charges with hydrogens summed into heavy atoms:
elementType: Br N N N C C C C C C C C C C C C C C C C C C C C C C C
charge: -0.015375 -0.141122 -0.002341 -0.171546 0.484393 -0.089330 -0.088649 -0.094058 -0.094473 -0.020590 -0.016498 0.012602 0.001450 0.006683 0.468298 -0.143776 -0.130604 -0.210431 -0.161189 0.474571 -0.222157 0.486394 -0.193623 -0.090127 0.096233 0.100075 -0.244813
polarizability: 6.79258613e+02 1.38390179e+01 2.69097538e+02 -1.21790710e+01 9.45298929e+00 1.57974264e+02
1716.lowfreq: -20.1433 -6.0565 -0.0007 0.0005 0.0012 3.2220 7.9198 15.7229 23.7843
frequency: -18.5821 15.4861 23.5393 34.6758 41.9214 56.3573 79.4927 104.5736 110.4472 138.8192 153.4481 165.7391 187.8696 201.5677 223.9541 228.9313 237.1890 247.5174 259.8022 289.6388 305.4797 308.2408 339.7716 369.7212 386.4786 392.8430 409.4673 411.3006 419.7883 423.2059 431.9681 450.9404 485.1878 503.0366 503.8248 523.0766 546.0314 556.2136 569.8480 618.8502 630.2443 647.5004 656.3503 688.0819 699.3144 712.1456 734.6506 781.8973 798.6552 802.8735 808.0616 812.2634 819.1450 821.2102 831.4854 844.0455 889.4337 896.5174 899.0676 910.4272 922.1485 925.6669 934.6793 945.9311 948.3177 966.0653 970.9114 982.6511 983.0882 995.0228 1002.8430 1021.5339 1033.3271 1054.8865 1062.0608 1080.7738 1081.6524 1090.6504 1102.5093 1116.5600 1120.0021 1136.0443 1138.0361 1157.0469 1176.5768 1182.8270 1194.3934 1203.2992 1210.0095 1246.4442 1251.6059 1256.8012 1260.9266 1270.7658 1279.8992 1282.7556 1288.2552 1312.6904 1317.2489 1323.2095 1327.7995 1335.6277 1339.9029 1340.7154 1345.1288 1348.9171 1359.8714 1361.2211 1367.0981 1378.7166 1387.1023 1391.6495 1409.0703 1442.1917 1448.5267 1454.9552 1463.5682 1464.2880 1471.2223 1472.6636 1474.0670 1482.6489 1488.4432 1492.3436 1508.7564 1528.7932 1547.0569 1576.4443 1593.3062 1608.9712 1629.4099 2906.7091 2916.4670 2948.9205 2956.3928 2959.2861 2964.1552 2967.8185 2969.2454 2975.1242 2978.6775 3008.2413 3022.9987 3026.1347 3027.3444 3029.4673 3032.4954 3039.6625 3041.2229 3046.0963 3111.8845 3121.6403 3145.4583 3159.8576 3167.5907 3172.2604 3177.5060 3188.5926 3395.4720
redmass: 4.0397 5.6684 5.3680 4.0954 3.8790 5.6638 4.1903 5.6975 4.3735 4.9610 5.0789 3.8256 3.3103 2.8751 2.9371 2.8857 3.1800 4.1435 3.7361 1.9946 4.9539 3.3411 2.3429 4.3745 2.6733 3.9884 1.9492 2.9969 3.1182 3.2337 2.9148 3.4440 3.0074 2.7279 3.4845 2.1772 2.2996 1.3077 3.2416 6.0391 6.6099 3.8450 6.2039 3.1666 3.3258 3.0949 3.4688 1.4686 1.3520 1.3901 1.5183 4.9203 2.0313 1.7290 1.4574 1.8544 3.6193 2.5523 3.5968 1.4435 2.4328 1.4571 1.3435 1.5802 1.7481 1.3380 1.3563 4.5392 2.3784 2.5589 2.0464 1.5427 1.8881 2.8136 1.8505 2.1630 3.6097 1.3328 1.6700 1.4661 2.0762 1.7274 1.4937 2.5858 1.1055 1.4877 2.2774 1.1698 1.1984 1.6033 1.3834 1.5000 1.4463 1.3230 1.4234 1.4926 1.8052 1.4470 1.6598 1.5479 1.5736 1.3876 1.4888 1.4769 1.5463 2.4651 1.6328 1.6764 1.4897 2.5702 2.2355 1.4827 3.8408 3.8376 1.0893 1.0874 1.0910 1.0904 2.2017 1.0915 1.0951 1.0913 1.1301 1.1195 1.9808 2.8293 6.7992 5.7724 4.7297 6.0001 6.2478 1.0703 1.0713 1.0604 1.0859 1.0642 1.0630 1.0604 1.0625 1.0636 1.0639 1.0977 1.0958 1.0950 1.0985 1.0999 1.0898 1.1001 1.0939 1.0995 1.0895 1.0894 1.0880 1.0898 1.0951 1.0931 1.0922 1.0951 1.0746
irintensity: 0.0175 0.2459 0.1892 1.3209 0.0171 0.4652 0.2347 0.5747 1.8446 0.1848 4.0571 0.6009 2.6433 4.4894 1.8505 22.6465 0.8767 5.0909 12.5234 13.8974 0.4599 12.0948 7.7259 24.4961 2.8668 7.4754 0.9317 0.1408 1.1607 6.5583 0.1645 2.4757 0.7800 41.9849 4.1726 13.6079 1.4521 70.4363 5.5359 10.6264 2.0644 39.5313 2.0825 7.0391 1.0053 0.8786 2.4751 0.8649 5.9587 37.6280 2.5496 14.3561 3.2126 31.9467 70.3712 11.5120 4.1048 26.8274 41.3254 21.8406 74.0490 6.1553 0.2857 6.1485 7.7720 0.2376 2.3537 21.1604 10.3836 0.7889 26.6186 2.7910 1.8582 88.5007 1.7883 0.9027 154.7673 10.0992 3.4034 53.3807 1.9275 3.3078 38.8174 7.2884 18.4019 125.1327 9.1481 46.3281 0.6628 128.2171 1.1147 18.7555 127.0792 31.6341 127.9720 71.5509 120.5736 0.3105 6.0777 6.4373 0.4715 3.1399 1.2718 0.4941 22.8488 191.1836 8.6231 11.0127 8.8051 50.6036 0.8399 92.1307 3.5747 9.8365 3.0534 3.9401 21.1025 4.1294 289.9272 17.6714 12.9248 26.2403 164.9304 91.4911 307.0647 41.0247 20.6993 15.6282 7.7458 386.4939 331.4483 72.5563 101.1715 27.5395 79.6772 33.7129 37.4865 30.3147 38.1041 16.0285 35.1338 48.5711 79.5943 59.5724 61.0981 24.1996 20.8577 89.9030 53.4509 73.4741 20.8877 16.4436 6.3918 5.1865 10.8187 20.5773 28.5236 1.5736 4.9675
temp: 298.150 k
press: 1.00000 atm
elementType: 35 7 7 7 6 6 6 6 6 6 6 6 6 6 6 6 6 6 6 6 6 6 6 6 6 6 6 1 1 1 1 1 1 1 1 1 1 1 1 1 1 1 1 1 1 1 1 1 1 1 1 1 1 1 1
symmnumber: 1
zpe: 1211619.3 jmol-1
zpe.correction: 0.461481 hartree
zpe.thermalcorrener: 0.485325 hartree
zpe.thermalcorrenthalpy: 0.486269 hartree
zpe.thermalcorrgfe: 0.406161 hartree
zpe.sumelectzpe: -1068.952666 hartree
zpe.sumelectthermal: -1068.928822 hartree
zpe.sumelectthermalent: -1068.927878 hartree
zpe.sumelectthermalfe: -1069.007986 hartree
dipole: 7.3646 2.2560 0.4001
dipole: 7.7128
quadrupole: -176.7262 -151.1174 -179.0879
quadrupole: -18.5580 -0.6469 2.7337
quadrupole: -7.7490 17.8597 -10.1107 -18.5580 -0.6469 2.7337
hfenergy: -1069.4141473 hartree
pointgroup: C01 [X(C23H28Br1N3)]
dipole: -2.8328922 1.0212887 0.3736 debye
polarizability: 673.6243886|-26.5421488|261.1313541|-46.4364968|35.3630751|171.5746726 unknown
InChI: InChI=1S/C23H28BrN3/c24-20-6-8-21(9-7-20)26-25-18-19-4-10-22(11-5-19)27-16-14-23(15-17-27)12-2-1-3-13-23/h4-11,18,26H,1-3,12-17H2
charge 0 multiplicity 1
55 atoms
Br 9.877814 -2.00943 -1.397024
N  -2.893484 -0.103858 0.594362
N  3.623568 0.783129 0.152213
N  4.896227 1.312178 0.185301
C  -5.790746 -0.786466 0.177062
C  -5.965956 -0.336603 -1.305927
C  -7.138229 -1.384619 0.679781
C  -4.685369 -1.866788 0.301347
C  -5.33144 0.371135 1.104477
C  -7.170877 0.610899 -1.524389
C  -8.347941 -0.441019 0.47827
C  -3.276317 -1.371267 -0.075781
C  -3.93894 0.934346 0.75974
C  -8.484411 -0.017042 -1.002992
C  -1.546473 0.308015 0.541886
C  -1.150594 1.63983 0.893859
C  -0.49756 -0.589097 0.141213
C  0.199563 2.026167 0.881884
C  0.845299 -0.191325 0.131283
C  1.235093 1.126882 0.506842
C  2.623938 1.574493 0.503988
C  6.010612 0.540927 -0.176449
C  7.304974 1.129909 -0.131435
C  5.873587 -0.814205 -0.586481
C  8.444369 0.381149 -0.489365
C  7.013353 -1.561569 -0.944007
C  8.289118 -0.960957 -0.893781
H  -6.116385 -1.247208 -1.924294
H  -5.04273 0.144036 -1.682252
H  -7.042856 -1.658717 1.750555
H  -7.330198 -2.329211 0.126884
H  -4.923179 -2.737011 -0.342615
H  -4.670332 -2.231255 1.348746
H  -5.31575 -0.013374 2.14443
H  -6.04407 1.216553 1.087551
H  -6.993335 1.575471 -1.006439
H  -7.262683 0.848664 -2.602064
H  -9.273238 -0.945511 0.818079
H  -8.233851 0.462423 1.110733
H  -2.56017 -2.156655 0.221505
H  -3.192095 -1.261027 -1.181062
H  -3.997926 1.568128 -0.15532
H  -3.641172 1.600252 1.588783
H  -8.726396 -0.911365 -1.614678
H  -9.325661 0.692342 -1.125221
H  -1.894687 2.389081 1.172968
H  -0.729793 -1.609674 -0.172254
H  0.456541 3.056138 1.162746
H  1.622167 -0.899086 -0.17648
H  2.80336 2.625721 0.814333
H  5.046519 2.288638 0.476928
H  7.42649 2.174014 0.182989
H  4.876852 -1.259517 -0.618422
H  9.436165 0.840952 -0.452205
H  6.904637 -2.603622 -1.259201
