program: Gaussian 09
title: 000286003
version: EM64L-G09RevD.01
frameworkgroup: C1[X(C13H15N5O5)]
method: RPBEPBE
basis: SDD
operation: Freq
keyword: #p
keyword: freq=noraman
keyword: PBEPBE/SDD
title: #p freq=noraman PBEPBE/SDD
converged: NO YES NO NO
title: Mulliken charges:
elementType: O O O O O N N N N N C C C C C C C C C C C C C H H H H H H H H H H H H H H H
charge: -0.262746 -0.270985 -0.233861 -0.390653 -0.251641 -0.189194 -0.086939 -0.048922 -0.063518 -0.610533 -0.172128 -0.157880 -0.103328 -0.141483 0.331352 -0.685628 -0.695565 0.212119 0.156859 -0.218449 -0.100320 0.161856 -0.363623 0.278656 0.276241 0.302131 0.286950 0.270023 0.223909 0.229980 0.224722 0.222094 0.244352 0.316920 0.388275 0.243963 0.344121 0.332875
chargesum: 0.00000
title: Mulliken charges with hydrogens summed into heavy atoms:
elementType: O O O O O N N N N N C C C C C C C C C C C C C
charge: -0.262746 -0.270985 -0.233861 -0.002379 -0.251641 -0.189194 -0.086939 -0.048922 -0.063518 0.066463 0.106528 0.118361 0.198802 0.145466 0.331352 0.038284 -0.004397 0.212119 0.156859 0.098470 -0.100320 0.161856 -0.119660
polarizability: 2.48530013e+02 -5.33909423e-02 1.86403037e+02 -8.58519765e+00 -2.24064724e+01 1.34824882e+02
1716.lowfreq: -10.5363 -6.3640 -3.2065 -0.0007 -0.0007 0.0004 20.3426 27.0097 44.2698
frequency: 20.1630 26.7425 44.2515 51.2812 79.4633 105.2788 112.3788 136.6131 159.8882 175.1979 188.6254 203.9195 227.2336 250.9890 252.3876 264.3704 278.7125 298.1734 329.5070 352.8664 379.3616 397.2563 408.9156 486.0771 509.5988 514.5476 543.3426 547.4849 561.8717 570.8715 603.1423 610.7343 622.0310 648.4591 654.4387 670.1153 686.8671 700.4377 712.8144 732.9037 736.9386 772.9923 797.9260 836.9575 847.3223 857.3831 859.4449 868.7172 896.2369 923.0350 929.4935 934.9851 952.5652 960.8999 989.1669 992.9640 1003.2874 1020.2926 1039.6998 1056.1801 1085.5629 1126.4168 1139.3891 1186.7108 1200.1429 1206.8313 1221.7196 1229.7544 1251.3147 1256.9494 1264.5223 1271.1743 1288.8210 1300.3630 1308.4687 1314.8522 1324.2367 1356.5679 1370.5399 1383.8069 1385.0570 1397.6391 1405.2288 1431.3092 1453.5308 1458.4156 1462.6702 1474.9538 1485.6779 1545.4102 1578.7870 1632.7031 1641.9837 2995.4408 3010.1979 3053.6026 3074.3875 3087.4537 3088.9098 3098.3298 3099.8190 3113.0673 3124.2690 3167.3993 3225.7719 3500.8395 3540.2156 3695.4520
redmass: 6.5116 4.7336 5.6154 7.4470 5.0076 8.9384 5.3758 5.5344 5.9151 1.4919 2.1623 6.9161 4.9408 5.3859 1.1283 3.4121 5.3058 4.2746 6.6982 2.8923 4.0821 3.1660 5.6137 4.3062 8.8005 1.2317 4.6886 1.0452 4.0705 4.0133 6.4468 1.8568 3.9717 5.2446 4.8579 8.0454 5.1074 7.0356 4.6632 7.3545 4.3940 5.6461 8.7520 6.1059 8.3407 2.6892 2.0436 2.6123 5.6279 1.6514 1.4307 4.0860 2.0731 2.4114 1.3289 4.6207 6.9629 5.1101 3.0731 2.9048 2.2513 4.3310 1.8598 2.0679 2.3834 2.1026 1.4242 2.1238 1.4979 2.1350 3.3082 1.6323 1.4383 2.6511 1.6074 4.1054 1.4750 2.6788 1.7987 2.8839 1.3075 1.2154 1.3680 2.8012 1.0500 1.0536 3.6659 1.0693 1.0493 8.3233 1.8635 2.7815 8.2644 1.0355 1.0357 1.0866 1.0874 1.0889 1.0873 1.1005 1.1002 1.0996 1.1010 1.0921 1.1006 1.0640 1.0443 1.1056
irintensity: 0.3356 0.4562 2.0227 1.9933 3.9844 1.2668 0.3934 2.5659 2.9709 1.4656 1.9373 0.4708 4.1641 7.3345 2.2800 11.1270 3.5354 0.6767 2.4566 1.7569 1.9555 7.0858 5.5601 12.8719 3.0643 266.7340 5.8363 1.1210 0.5327 51.6649 9.9040 87.9193 15.0196 38.4551 11.6733 3.0746 39.0089 21.0008 43.6303 11.3483 17.2195 119.4466 9.0404 14.4285 6.8742 4.5015 48.3771 3.8723 49.8327 8.2441 11.6220 110.8578 11.1110 5.3001 4.2338 193.9224 29.9431 97.8533 56.8041 85.8597 114.3056 25.1094 42.5310 67.9995 69.5656 22.3853 3.2748 166.7696 7.7040 11.7312 82.7176 27.8258 12.9862 57.3680 26.6228 18.1048 11.4011 87.8597 39.8333 10.4868 46.1184 34.7960 13.0313 59.0490 5.3556 2.0883 26.8466 1.2915 13.2925 68.5626 36.7213 689.0057 140.0125 9.9547 11.9383 9.0356 5.5107 20.1857 6.2703 10.7417 5.6347 20.4727 16.6536 16.6209 31.3479 40.1746 128.5674 49.2025
temp: 298.150 k
press: 1.00000 atm
elementType: 8 8 8 8 8 7 7 7 7 7 6 6 6 6 6 6 6 6 6 6 6 6 6 1 1 1 1 1 1 1 1 1 1 1 1 1 1 1
symmnumber: 1
zpe: 751927.5 jmol-1
zpe.correction: 0.286394 hartree
zpe.thermalcorrener: 0.306572 hartree
zpe.thermalcorrenthalpy: 0.307516 hartree
zpe.thermalcorrgfe: 0.236392 hartree
zpe.sumelectzpe: -1152.561870 hartree
zpe.sumelectthermal: -1152.541693 hartree
zpe.sumelectthermalent: -1152.540749 hartree
zpe.sumelectthermalfe: -1152.611872 hartree
dipole: -2.0673 1.8299 -0.5808
dipole: 2.8213
quadrupole: -118.9495 -124.8219 -137.8855
quadrupole: 7.0887 -6.6258 2.1344
quadrupole: 8.2694 2.3971 -10.6665 7.0887 -6.6258 2.1344
hfenergy: -1152.8482644 hartree
pointgroup: C01 [X(C13H15N5O5)]
dipole: -0.8737655 -0.5995117 0.330409 debye
polarizability: 247.5351366|-10.2741343|186.1479524|-4.958358|-23.8869429|136.0748428 unknown
InChI: InChI=1S/C13H15N5O5/c1-13(2)22-6-7(23-13)11(21-8(6)12(19)20)18-4-17-5-9(14)15-3-16-10(5)18/h3-4,6-8,11,19H,14H2,1-2H3
charge 0 multiplicity 1
38 atoms
O  -1.804111 2.105564 1.12984
O  -3.747077 0.817686 0.844788
O  -1.275924 -0.451174 -1.041006
O  -2.750495 -3.304443 -0.955741
O  -1.556337 -2.899585 0.993602
N  0.83268 -0.209671 0.174235
N  2.47839 -1.587081 0.995298
N  2.244124 1.354113 -1.148226
N  4.634251 0.788614 -1.006346
N  5.450558 -1.039358 0.25052
C  -1.345987 0.71505 1.105796
C  -2.648704 -0.144946 0.962647
C  -0.460538 0.395904 -0.134589
C  -2.455358 -0.998298 -0.316518
C  -3.174656 2.163969 0.545405
C  -3.125522 2.413108 -0.969959
C  -3.972199 3.202839 1.32415
C  -2.195025 -2.471164 0.003018
C  2.048492 0.278022 -0.337213
C  1.158666 -1.334492 0.965248
C  3.046796 -0.581171 0.1871
C  4.392217 -0.288006 -0.18368
C  3.569725 1.535065 -1.433346
H  -0.798491 0.54594 2.045434
H  -2.854333 -0.767661 1.84664
H  -0.224366 1.318738 -0.692935
H  -3.320712 -0.909047 -0.99104
H  -2.56324 1.62299 -1.496175
H  -4.152242 2.439404 -1.374203
H  -2.641705 3.384145 -1.172452
H  -3.534034 4.204099 1.175458
H  -5.017649 3.217171 0.973012
H  -3.955708 2.958726 2.39785
H  0.394723 -1.937318 1.452348
H  -2.532331 -4.255827 -0.753683
H  3.81316 2.380634 -2.0832
H  5.289102 -1.840842 0.856588
H  6.39046 -0.7856 -0.046366
