program: Gaussian 09
title: 000286004
version: EM64L-G09RevD.01
frameworkgroup: C1[X(C14H17N5O5)]
method: RPBEPBE
basis: SDD
operation: Freq
keyword: #p
keyword: freq=noraman
keyword: PBEPBE/SDD
title: #p freq=noraman PBEPBE/SDD
converged: YES YES NO NO
title: Mulliken charges:
elementType: O O O O O N N N N N C C C C C C C C C C C C C C H H H H H H H H H H H H H H H H H
charge: -0.263783 -0.272402 -0.231629 -0.246054 -0.264105 -0.189946 -0.089124 -0.048430 -0.063887 -0.611020 -0.173873 -0.155294 -0.103512 -0.176007 0.332320 -0.696813 -0.686775 0.279453 0.156184 -0.218288 -0.100723 0.160488 -0.502185 -0.364548 0.277251 0.275657 0.300308 0.284227 0.244040 0.221569 0.223980 0.222828 0.272361 0.228626 0.318694 0.251607 0.246353 0.242940 0.243558 0.343627 0.332330
chargesum: 0.00000
title: Mulliken charges with hydrogens summed into heavy atoms:
elementType: O O O O O N N N N N C C C C C C C C C C C C C C
charge: -0.263783 -0.272402 -0.231629 -0.246054 -0.264105 -0.189946 -0.089124 -0.048430 -0.063887 0.064937 0.103378 0.120363 0.196796 0.108220 0.332320 -0.007224 0.037040 0.279453 0.156184 0.100405 -0.100723 0.160488 0.238714 -0.120990
polarizability: 2.56494729e+02 -1.82196502e+00 2.00941877e+02 5.47423702e+00 -2.36888311e+01 1.47805373e+02
1716.lowfreq: -7.4565 -2.9416 0.0004 0.0005 0.0009 5.3745 18.3695 33.9106 43.7455
frequency: 18.1761 33.7080 43.6750 47.4726 69.8738 73.5139 108.6978 113.0878 128.4194 143.1076 160.3801 170.9239 192.7582 213.8636 229.2602 248.6305 258.7051 267.5017 271.7517 283.5841 300.5711 332.9461 351.4718 380.4047 398.8452 409.7959 487.8890 509.8467 509.9986 545.0939 545.3027 562.2888 598.9712 608.6161 645.5998 649.5635 658.2150 669.6007 684.9555 701.9755 724.6645 733.8316 735.1588 773.6219 798.1309 833.8042 846.8340 855.1217 858.5466 862.8534 875.7889 915.9734 924.3235 929.1637 950.4931 959.1176 966.7764 990.4524 996.7024 1003.8647 1023.1849 1040.6415 1069.6983 1113.8849 1125.5327 1139.0168 1148.2451 1161.7143 1187.8506 1200.3774 1207.5325 1227.7293 1236.3209 1258.0165 1264.1600 1264.6192 1285.7442 1297.8649 1302.9826 1314.4475 1322.2400 1352.0051 1356.7030 1383.4268 1385.0750 1397.3813 1404.7664 1422.2940 1431.0616 1453.0843 1453.3656 1458.2116 1460.1539 1462.5612 1475.3446 1485.0980 1544.8202 1578.3448 1622.3401 1632.4191 2995.4941 3009.6993 3011.4812 3053.0205 3075.3001 3086.2869 3088.0777 3098.6584 3100.0933 3112.5004 3117.0913 3123.8156 3160.9654 3166.8156 3222.6772 3540.8594 3696.3080
redmass: 5.1626 4.5394 5.3543 5.0412 3.7199 1.1345 7.5079 5.1273 5.1133 4.7745 5.1973 1.1688 4.2016 3.7210 6.2188 5.0519 1.2248 2.8498 6.1339 4.9790 4.2193 5.0393 2.8607 4.0537 3.2204 5.7320 4.3098 6.4560 1.2979 1.4605 2.0757 4.0731 7.5622 4.6929 5.6821 5.7586 6.7835 9.0058 7.7978 7.0593 7.1399 7.2614 4.5560 5.6744 8.5327 6.0448 8.0360 1.7683 4.0270 3.8503 3.5075 5.0953 1.6031 1.4309 2.0084 2.7249 4.1342 1.3161 5.4937 7.0937 5.6849 2.8692 2.6552 1.2688 4.2924 1.8831 1.5529 2.6298 2.1550 2.4804 2.0232 1.8370 1.7718 2.0274 2.4867 2.1173 1.5713 1.3254 3.2068 4.1415 1.4631 1.4862 2.6618 2.8872 1.2990 1.2180 1.3500 1.2087 2.7764 1.0492 1.0494 1.0539 1.0573 3.5496 1.0686 1.0491 8.2714 1.8518 8.1477 2.8384 1.0355 1.0356 1.0293 1.0864 1.0874 1.0870 1.0890 1.1001 1.1006 1.0996 1.1051 1.1010 1.1053 1.0921 1.1008 1.0442 1.1056
irintensity: 0.8221 0.5644 1.8510 0.9538 3.3575 0.3876 1.5553 0.5398 1.1647 2.4461 0.7156 0.4390 2.2390 4.5816 6.5651 7.3103 2.4773 8.4274 18.4936 5.8746 8.1516 14.4021 1.3822 1.4180 2.6217 1.8841 12.6077 16.8994 253.7076 1.6399 2.4139 0.3655 7.1533 1.9184 5.6947 38.2757 7.1264 0.4462 12.9729 22.6627 21.1359 14.1927 17.1856 114.8234 9.3329 21.6254 4.8885 14.9205 33.3611 6.9122 0.8946 107.4372 0.4305 11.8796 6.5080 6.6501 66.9574 2.0042 221.6121 6.4336 71.0235 56.9124 16.9562 0.2506 19.6977 11.2947 20.7030 217.0027 68.0678 83.9738 11.9385 114.7167 66.4881 7.2488 70.2581 59.4953 38.3363 22.2012 63.2034 18.4065 9.5265 21.1374 80.6810 10.8118 45.6764 35.4639 13.7658 15.6927 61.8373 5.1405 16.4125 2.0771 12.8701 25.2259 1.0260 12.7079 67.6543 35.7285 249.3177 555.8571 10.8415 13.4236 24.0889 8.4499 6.6441 6.8480 18.4042 8.2085 7.5203 21.0839 20.2489 16.9555 12.9481 17.0266 33.4993 126.4676 48.8670
temp: 298.150 k
press: 1.00000 atm
elementType: 8 8 8 8 8 7 7 7 7 7 6 6 6 6 6 6 6 6 6 6 6 6 6 6 1 1 1 1 1 1 1 1 1 1 1 1 1 1 1 1 1
symmnumber: 1
zpe: 824069.6 jmol-1
zpe.correction: 0.313872 hartree
zpe.thermalcorrener: 0.335833 hartree
zpe.thermalcorrenthalpy: 0.336777 hartree
zpe.thermalcorrgfe: 0.261564 hartree
zpe.sumelectzpe: -1191.775937 hartree
zpe.sumelectthermal: -1191.753976 hartree
zpe.sumelectthermalent: -1191.753031 hartree
zpe.sumelectthermalfe: -1191.828245 hartree
dipole: 2.2397 2.6181 -0.4917
dipole: 3.4803
quadrupole: -126.8750 -124.6467 -144.0980
quadrupole: -5.7984 7.7811 2.3039
quadrupole: 4.9983 7.2265 -12.2248 -5.7984 7.7811 2.3039
hfenergy: -1192.0898087 hartree
pointgroup: C01 [X(C14H17N5O5)]
dipole: 1.0723461 -0.7976402 0.2978748 debye
polarizability: 251.2812083|16.7194148|205.6005929|11.7655945|-21.702297|148.3601773 unknown
InChI: InChI=1S/C14H17N5O5/c1-14(2)23-7-8(24-14)12(22-9(7)13(20)21-3)19-5-18-6-10(15)16-4-17-11(6)19/h4-5,7-9,12H,15H2,1-3H3
charge 0 multiplicity 1
41 atoms
O  1.354774 2.62076 1.129284
O  3.48836 1.650537 0.978755
O  1.328357 -0.082702 -0.913273
O  3.185831 -2.663213 -0.63819
O  1.921376 -2.342901 1.289784
N  -0.833902 -0.147476 0.232777
N  -2.262579 -1.727141 1.096349
N  -2.428418 1.068029 -1.240163
N  -4.695396 0.117924 -1.133951
N  -5.2495 -1.736474 0.22338
C  1.125856 1.174476 1.170091
C  2.553285 0.529562 1.113098
C  0.351557 0.652289 -0.075155
C  2.547434 -0.407061 -0.121539
C  2.721416 2.869825 0.587222
C  3.311478 4.060692 1.332781
C  2.693433 3.032812 -0.940328
C  2.504841 -1.884477 0.275688
C  -2.090693 0.093771 -0.350463
C  -1.002983 -1.257079 1.091397
C  -2.9542 -0.886318 0.200413
C  -4.312737 -0.847734 -0.231071
C  3.152146 -4.13179 -0.39965
C  -3.752014 1.004257 -1.578778
H  0.577751 0.967103 2.101775
H  2.819443 -0.009477 2.034925
H  -0.017726 1.493774 -0.687355
H  3.413509 -0.21764 -0.774476
H  3.28835 3.870697 2.41724
H  4.355623 4.223945 1.017016
H  2.727795 4.970563 1.113568
H  3.718796 3.197186 -1.314362
H  2.279066 2.139003 -1.436669
H  2.07447 3.905572 -1.210918
H  -0.172931 -1.689376 1.64703
H  2.111236 -4.492007 -0.442144
H  3.582094 -4.363663 0.588687
H  3.756368 -4.55858 -1.210999
H  -4.104807 1.754145 -2.292823
H  -4.982945 -2.45709 0.89068
H  -6.205818 -1.662121 -0.116833
