program: Gaussian 09
title: 000286026
version: EM64L-G09RevD.01
frameworkgroup: C1[X(C25H23N3)]
method: RPBEPBE
basis: SDD
operation: Freq
keyword: #pfreq=noraman
keyword: PBEPBE/SDD
title: #p freq=noraman PBEPBE/SDD
converged: YES YES NO NO
title: Mulliken charges:
elementType: N N N C C C C C C C C C C C C C C C C C C C C C C C C C H H H H H H H H H H H H H H H H H H H H H H H
charge: -0.465854 -0.481740 0.001047 0.111953 0.251518 -0.648558 0.438736 -0.772785 0.047101 0.150374 0.440601 0.180015 -0.595418 -0.326679 -0.334666 -0.368976 -0.807937 0.200844 0.295919 -0.361513 -0.285104 -0.219086 -0.358374 -0.374577 -0.380727 -0.442151 -0.223324 -0.254637 0.222209 0.236158 0.252334 0.225724 0.220365 0.298596 0.336197 0.260552 0.251732 0.237093 0.247292 0.212492 0.273700 0.249264 0.231153 0.223980 0.224001 0.237900 0.236427 0.232568 0.236470 0.219160 0.218629
chargesum: 0.00000
title: Mulliken charges with hydrogens summed into heavy atoms:
elementType: N N N C C C C C C C C C C C C C C C C C C C C C C C C C
charge: -0.167258 -0.145543 0.001047 0.111953 0.251518 -0.190190 0.438736 -0.074362 0.047101 0.150374 0.440601 0.180015 -0.334866 -0.074947 -0.097573 -0.121684 -0.072480 0.200844 0.295919 -0.130360 -0.061124 0.004915 -0.120475 -0.138150 -0.148159 -0.205681 -0.004164 -0.036008
polarizability: 3.56281870e+02 -6.99023610e+00 2.87602338e+02 -3.87705702e+01 -8.36842177e+00 2.12547182e+02
1716.lowfreq: -11.3193 -6.2326 -4.8612 -0.0007 -0.0004 0.0005 20.2516 24.1717 37.0880
frequency: 20.0226 24.0138 37.0093 44.0842 47.6647 61.3372 96.0744 114.0217 122.9410 138.1207 163.7873 166.5701 193.4895 228.7619 248.7799 253.5072 287.1879 297.2181 300.0723 307.2256 323.9936 328.9968 359.7312 369.6524 408.6149 432.5084 436.0662 449.8864 485.7554 506.6103 524.2108 531.6099 547.8736 570.5361 576.0203 578.9314 584.1929 602.0766 605.1858 637.8485 654.1035 662.2422 667.5031 680.7786 709.5209 743.4735 751.6871 753.5193 754.4695 762.9800 797.5704 806.4907 826.2201 834.6665 850.9499 853.4856 854.5151 875.5426 880.9962 885.6522 911.3829 922.2426 930.0115 934.7297 962.4120 963.9161 968.3836 974.8014 977.8244 983.8450 994.2989 1012.3398 1014.1651 1038.6765 1048.3880 1061.5972 1073.3779 1084.0271 1104.7608 1112.5828 1119.8817 1141.3681 1155.1290 1164.2940 1167.9634 1212.0164 1217.3975 1224.8569 1229.2077 1237.4144 1242.3043 1258.5727 1292.6219 1298.2791 1303.4919 1314.1207 1324.7059 1332.1514 1340.2983 1382.7534 1392.5750 1399.9120 1403.1686 1410.3129 1419.4221 1421.1572 1456.1839 1459.1260 1462.4123 1464.6491 1467.8756 1469.4651 1481.6584 1482.3863 1485.0167 1497.5091 1544.5040 1555.1875 1561.6585 1580.9023 1581.5012 1591.4312 1629.0415 1630.5838 2984.2746 2985.9478 2988.0080 3053.3190 3063.7383 3077.5166 3096.9994 3098.7199 3121.1898 3124.5034 3126.1101 3126.8528 3129.6135 3134.8636 3143.2305 3149.1066 3151.5865 3160.5556 3164.0174 3164.7543 3207.1160 3570.3527 3598.3668
redmass: 4.8973 4.5095 5.2812 4.0523 4.2989 5.2057 3.9306 5.3862 3.3186 1.1200 4.9126 5.0722 4.9815 3.9202 3.8322 3.2646 3.0664 3.4599 3.7512 3.1745 1.2481 2.7005 4.6266 2.4878 3.7496 3.0189 3.0076 2.8221 5.4414 4.8745 3.6199 1.3260 3.4865 1.3284 3.2930 3.1949 2.8776 5.2364 6.3706 4.7666 4.5620 6.0260 5.2733 4.2382 4.5164 1.2911 1.4479 3.0202 2.9646 3.9115 1.7010 2.7661 1.4971 2.8384 1.6176 1.7541 2.4189 3.9530 2.5355 1.4647 2.0831 3.9110 1.3916 1.3791 1.3956 6.4893 1.2988 1.2996 1.4719 4.3783 1.6838 2.2261 2.0676 1.4555 2.0768 2.5340 1.9491 1.7726 2.2806 1.6377 1.7880 1.5141 1.7960 1.0937 1.1156 2.7920 2.0043 1.3537 2.2130 1.4661 1.4187 1.9793 2.9726 2.7106 3.5913 2.2979 1.9787 1.5580 1.5571 1.2395 4.2091 2.4115 2.5081 1.5363 2.6624 2.0864 1.2593 2.8641 1.3363 2.9771 1.5705 1.1311 2.6550 2.9955 1.1455 1.0747 6.9866 6.1172 6.6290 5.5420 6.0415 5.6102 6.6900 7.2125 1.0380 1.0419 1.0546 1.1003 1.0984 1.0992 1.0966 1.1003 1.0846 1.0880 1.0853 1.0891 1.0890 1.0891 1.0954 1.0948 1.0963 1.1002 1.0946 1.1000 1.0977 1.0812 1.0804
irintensity: 0.6901 1.2429 0.0392 0.3646 0.2477 0.5973 0.6090 2.2790 2.7466 0.1560 2.4729 0.3228 1.9047 0.6595 0.6339 0.2281 0.0639 1.0817 1.4067 0.7343 0.5969 2.1498 1.3738 0.1375 4.5697 9.9219 4.0459 1.1330 0.1407 1.1896 0.4085 86.4312 12.4831 41.8548 0.8929 22.2061 10.1713 2.2486 2.4048 13.9020 15.5100 0.9047 3.6304 2.1660 7.7548 40.7237 88.8795 24.6614 13.3638 11.6167 42.4495 13.9332 43.2047 5.4873 0.2242 3.7044 2.9248 0.4125 1.6934 0.3385 2.4238 0.9502 4.8258 1.7828 0.5465 3.6456 0.0907 0.0380 0.1116 2.1614 4.7676 9.0454 7.4426 7.0928 14.9288 20.2190 0.8592 5.9388 12.6272 3.7201 11.2309 12.7681 8.4001 2.0137 5.4237 18.6658 25.7114 0.9650 1.6906 7.8243 6.9767 1.7045 8.7428 28.4608 9.6334 16.2852 1.0404 2.4731 7.9583 39.0766 33.4688 11.4199 24.9362 30.4829 10.1403 27.1938 14.6013 18.1727 24.4084 12.0250 13.6668 10.2021 8.9902 5.2780 10.8853 2.6105 7.2889 17.1184 15.4434 75.5200 11.8591 9.1326 1.9149 2.0335 6.1274 54.9071 17.3964 17.3732 23.6686 26.8600 10.8316 22.9427 0.3934 22.2456 1.0449 12.9068 4.3504 7.0598 35.7098 26.0722 24.7923 38.7129 11.7602 24.8085 4.9757 88.2125 46.6858
temp: 298.150 k
press: 1.00000 atm
elementType: 7 7 7 6 6 6 6 6 6 6 6 6 6 6 6 6 6 6 6 6 6 6 6 6 6 6 6 6 1 1 1 1 1 1 1 1 1 1 1 1 1 1 1 1 1 1 1 1 1 1 1
symmnumber: 1
zpe: 1088120.4 jmol-1
zpe.correction: 0.414443 hartree
zpe.thermalcorrener: 0.437909 hartree
zpe.thermalcorrenthalpy: 0.438853 hartree
zpe.thermalcorrgfe: 0.360542 hartree
zpe.sumelectzpe: -1128.793955 hartree
zpe.sumelectthermal: -1128.770489 hartree
zpe.sumelectthermalent: -1128.769545 hartree
zpe.sumelectthermalfe: -1128.847856 hartree
dipole: -2.2436 1.9492 2.5234
dipole: 3.8988
quadrupole: -195.1494 -149.5585 -155.3708
quadrupole: -0.1292 -5.4247 4.4273
quadrupole: -28.4565 17.1344 11.3221 -0.1292 -5.4247 4.4273
hfenergy: -1129.2083979 hartree
pointgroup: C01 [X(C25H23N3)]
dipole: 0.7547549 0.8031136 -1.0668652 debye
polarizability: 349.418187|11.3063642|289.4447421|-47.9648512|1.9996476|217.5684606 unknown
InChI: InChI=1S/C25H23N3/c1-17-24(21-8-4-6-10-23(21)27-17)25(2,19-11-13-26-14-12-19)16-20-15-18-7-3-5-9-22(18)28-20/h3-15,27-28H,16H2,1-2H3
charge 0 multiplicity 1
51 atoms
N  -0.129189 2.096901 -1.849467
N  1.917991 0.165917 0.737698
N  -5.214436 -2.064789 0.744287
C  -0.985123 -1.239407 -0.279852
C  -0.811859 0.201379 -0.77132
C  -0.005923 -1.477116 0.945274
C  -2.456052 -1.491564 0.138732
C  -0.669745 -2.314178 -1.362927
C  -1.216282 1.370309 0.010141
C  -0.138708 0.689257 -1.905419
C  1.437977 -1.154818 0.670685
C  -0.774208 2.544268 -0.695405
C  2.507787 -1.995353 0.344009
C  -3.517622 -0.980086 -0.652172
C  -2.824526 -2.29898 1.244893
C  -1.907452 1.547331 1.242756
C  0.596925 0.031815 -3.046974
C  3.283228 0.191612 0.439103
C  3.68821 -1.170971 0.187847
C  -1.003208 3.85618 -0.225827
C  -2.132496 2.851838 1.723563
C  -1.686984 3.996483 0.998727
C  -4.854038 -1.286613 -0.322393
C  -4.191331 -2.551843 1.505728
C  4.187988 1.274102 0.373569
C  5.046542 -1.433458 -0.134814
C  5.528804 0.982416 0.047902
C  5.952836 -0.357021 -0.203205
H  -0.06167 -2.541038 1.23757
H  -0.365266 -0.881136 1.806813
H  0.394486 -2.288352 -1.649552
H  -0.890505 -3.318486 -0.957898
H  -1.294827 -2.173089 -2.261671
H  0.298738 2.69022 -2.557519
H  1.323232 0.978767 0.899173
H  2.450177 -3.078878 0.247274
H  -3.301307 -0.33245 -1.508258
H  -2.075292 -2.734741 1.91189
H  -2.282258 0.685827 1.80481
H  0.868527 0.779647 -3.814354
H  1.534328 -0.441164 -2.700793
H  -0.006171 -0.744953 -3.542702
H  -0.664329 4.734492 -0.786776
H  -2.667562 2.993482 2.668972
H  -1.882297 4.997807 1.397977
H  -5.68157 -0.896087 -0.925826
H  -4.487742 -3.171623 2.360308
H  3.867062 2.302733 0.573601
H  5.385053 -2.457961 -0.326766
H  6.259453 1.797159 -0.009914
H  7.003633 -0.54569 -0.450602
