program: Gaussian 09
title: 000286036
version: EM64L-G09RevD.01
frameworkgroup: C1[X(C22H22N4O4S3)]
method: RPBEPBE
basis: SDD
operation: Freq
keyword: #p
keyword: freq=noraman
keyword: PBEPBE/SDD
title: #p freq=noraman PBEPBE/SDD
converged: NO YES NO NO
title: Mulliken charges:
elementType: S S S O O O O N N N N C C C C C C C C C C C C C C C C C C C C C C H H H H H H H H H H H H H H H H H H H H H H
charge: 0.865651 0.147917 0.147875 -0.240954 -0.240960 -0.533074 -0.530612 -0.181334 -0.181291 0.318734 0.318662 -0.385909 -0.385918 -0.385895 -0.385924 0.296528 0.296553 -0.316084 -0.308293 -0.316150 -0.308332 -0.055541 -0.055542 0.346786 0.346783 -0.312239 -0.312205 -0.396060 -0.396348 -0.269395 -0.269033 -0.782375 -0.782277 0.232312 0.220249 0.235472 0.235429 0.220196 0.232301 0.235430 0.235446 0.224849 0.199056 0.211823 0.225178 0.199071 0.224838 0.225170 0.211831 0.258721 0.258730 0.300473 0.300596 0.279610 0.279478
chargesum: 0.00000
title: Mulliken charges with hydrogens summed into heavy atoms:
elementType: S S S O O O O N N N N C C C C C C C C C C C C C C C C C C C C C C
charge: 0.865651 0.147917 0.147875 -0.240954 -0.240960 -0.533074 -0.530612 -0.181334 -0.181291 0.318734 0.318662 0.066651 0.084982 0.066602 0.084953 0.296528 0.296553 0.107822 0.128709 0.107759 0.128668 -0.055541 -0.055542 0.346786 0.346783 -0.053518 -0.053476 -0.095587 -0.095752 0.010214 0.010444 -0.782375 -0.782277
polarizability: 4.65727809e+02 2.21719101e-01 4.41416811e+02 -7.45264037e-02 -2.92330790e+01 2.61218312e+02
1716.lowfreq: -2.1359 -0.0009 -0.0007 0.0003 2.8398 5.9367 10.9184 12.5526 15.3088
frequency: 10.9160 12.4443 15.1879 23.2424 25.2092 41.0113 52.2141 58.1086 64.5296 69.4543 76.1843 96.1387 101.0754 112.2717 125.7756 160.3625 166.4519 189.0590 198.5876 211.6107 230.5480 240.2096 251.9816 255.4985 262.3082 280.7395 284.4079 300.3306 308.5126 315.0564 339.3933 356.2407 366.9250 393.2758 394.7598 399.6627 403.3061 409.5039 409.9431 419.4914 420.8585 429.8764 457.5882 458.2272 469.0881 487.3328 488.5008 528.8408 530.6930 561.7896 564.6230 589.5369 595.2379 630.4357 637.1265 659.4040 660.5448 727.4973 734.1335 737.8515 739.6046 783.7364 799.8056 800.0026 821.3139 824.3671 845.1554 845.4758 899.3256 900.7162 905.3275 909.0362 909.2906 911.6396 921.5814 925.5719 933.3193 952.8561 957.7671 1018.9948 1019.1927 1033.5364 1034.2365 1053.3022 1053.3782 1066.4092 1073.2891 1078.4196 1078.5541 1102.7740 1102.9350 1123.2641 1127.4875 1162.5133 1164.4821 1195.9016 1196.0161 1220.5172 1221.8421 1241.5153 1242.7991 1249.5638 1251.2970 1262.2295 1264.7779 1281.9464 1282.2070 1333.3285 1333.5134 1346.8218 1347.1101 1355.2913 1356.2784 1363.1313 1363.5578 1374.0162 1374.6720 1379.6118 1380.9779 1403.8202 1406.6608 1447.0916 1447.1700 1453.4444 1453.7840 1456.8325 1456.9069 1464.5869 1464.9684 1486.7687 1489.4896 1561.4535 1564.9351 1588.7058 1590.7886 2182.0247 2186.7864 2924.9844 2925.1822 2941.0152 2941.1332 2961.2107 2961.2780 2973.2346 2973.2633 3055.9899 3056.0367 3085.0013 3085.0444 3095.1200 3095.1540 3109.7483 3109.8829 3150.9662 3152.1220 3160.4961 3162.3230 3169.8440 3170.6047
redmass: 10.7379 10.9988 7.7926 11.5980 12.1350 5.7376 4.6443 5.3023 5.6653 6.1725 9.3429 3.9583 3.8150 7.1331 6.7769 7.4676 6.9559 7.3141 5.0387 8.6082 4.9717 4.9552 6.9720 3.5937 3.5196 2.7667 3.2845 6.0234 4.4629 4.7061 8.6874 5.1994 6.3967 3.9181 2.4428 3.6065 10.2619 6.7723 7.5222 5.7374 5.1833 7.5054 2.8446 2.7529 8.7682 3.7006 3.6100 3.4698 3.7451 3.7865 4.2775 4.0723 4.6371 3.5831 4.7876 4.3408 3.7391 5.8721 6.1885 3.6973 3.8314 14.5064 4.0705 4.1137 1.4900 1.4934 1.6142 1.6076 2.1266 3.5335 2.3381 2.4518 2.4963 1.7140 7.7402 6.1587 6.8028 1.3753 1.3810 2.2597 2.2587 2.5168 2.5070 1.9623 1.9627 1.9937 2.0264 4.3546 4.2925 2.1546 2.1581 2.2224 2.4341 2.3493 2.1960 1.0801 1.0793 1.7140 1.6962 1.5704 1.5077 1.7222 1.8351 1.4090 1.3864 1.1999 1.1999 1.3079 1.3019 1.3894 1.3587 1.7880 1.7909 1.6072 1.6216 1.9886 1.7523 2.0071 2.3908 4.0286 4.0342 1.0826 1.0825 1.1128 1.1059 1.0983 1.0985 1.1451 1.1357 2.7542 2.8609 8.0500 7.8804 6.4714 6.5520 12.8721 12.8760 1.0677 1.0678 1.0721 1.0721 1.0663 1.0663 1.0664 1.0664 1.0935 1.0935 1.0973 1.0973 1.0986 1.0986 1.0899 1.0899 1.0877 1.0876 1.0925 1.0925 1.0962 1.0963
irintensity: 0.1162 0.0060 0.2873 0.6902 0.8462 1.4633 1.0075 0.1373 2.0335 0.0118 1.4429 2.4250 3.0426 0.4904 0.2257 0.6797 2.1907 5.8235 0.1135 4.8623 3.1176 6.1814 4.8854 0.2257 22.1202 1.2876 1.0987 30.1748 18.1057 2.1000 4.1221 17.4587 0.2805 6.7507 3.1247 1.1637 1.7513 5.8757 0.5422 5.2680 12.1764 19.5013 23.7886 1.3857 131.6022 18.4620 13.9329 4.0589 43.4198 22.0043 9.8371 126.4769 28.6042 3.3520 21.7663 41.4283 0.8023 36.5083 1.3038 0.0024 2.0381 106.3615 10.9422 2.8347 18.1445 24.3283 6.8789 3.3051 8.1169 26.1771 20.2651 17.4404 6.3378 43.5525 42.0608 72.1592 56.7603 1.8760 4.1539 21.0676 16.5132 47.1513 18.4829 0.7980 39.2749 120.5582 19.9812 23.1456 54.9080 12.1389 3.2653 53.2442 0.3356 4.0792 22.7779 12.0755 7.0135 47.3903 26.0826 62.7468 103.4797 2.7866 4.7022 46.6926 20.6057 19.3478 4.8592 5.7148 5.1449 0.3276 3.0155 0.6873 5.8984 75.3510 15.3495 10.5109 8.4536 62.2788 9.4190 14.3765 53.4855 3.9108 4.0972 43.3260 41.4779 12.7806 8.3777 40.7212 48.9865 242.0779 31.7475 48.5486 24.0826 63.6422 47.1914 523.7486 1795.8819 45.1975 88.8339 104.0909 23.4935 18.1606 84.8355 15.7022 85.5266 28.2364 19.4544 14.1810 57.9555 58.9073 5.6690 6.4568 6.7450 0.0794 9.2211 6.4628 4.2759 16.1273 8.6048
temp: 298.150 k
press: 1.00000 atm
elementType: 16 16 16 8 8 8 8 7 7 7 7 6 6 6 6 6 6 6 6 6 6 6 6 6 6 6 6 6 6 6 6 6 6 1 1 1 1 1 1 1 1 1 1 1 1 1 1 1 1 1 1 1 1 1 1
symmnumber: 1
zpe: 1078221.5 jmol-1
zpe.correction: 0.410673 hartree
zpe.thermalcorrener: 0.442188 hartree
zpe.thermalcorrenthalpy: 0.443132 hartree
zpe.thermalcorrgfe: 0.342703 hartree
zpe.sumelectzpe: -2563.016691 hartree
zpe.sumelectthermal: -2562.985176 hartree
zpe.sumelectthermalent: -2562.984232 hartree
zpe.sumelectthermalfe: -2563.084660 hartree
dipole: -0.0112 -3.1197 6.6559
dipole: 7.3508
quadrupole: -215.5910 -233.5200 -230.1078
quadrupole: 0.0191 0.0123 -19.8499
quadrupole: 10.8153 -7.1137 -3.7015 0.0191 0.0123 -19.8499
hfenergy: -2563.4273636 hartree
pointgroup: C01 [X(C22H22N4O4S3)]
dipole: 0.0085492 -0.8527335 2.7634434 debye
polarizability: 465.7270729|0.4279593|330.8156778|-0.0409342|92.4773455|371.8201805 unknown
InChI: InChI=1S/C22H22N4O4S3/c27-33(28,17-1-3-21(19(13-17)23-15-31)25-5-9-29-10-6-25)18-2-4-22(20(14-18)24-16-32)26-7-11-30-12-8-26/h1-4,13-14H,5-12H2
charge 0 multiplicity 1
55 atoms
S  -0.003103 2.853496 -0.557155
S  4.760884 -2.604637 -3.517426
S  -4.766214 -2.613878 -3.506789
O  7.424123 -1.825122 1.479081
O  -7.410406 -1.848806 1.496377
O  -0.004083 4.115098 0.488818
O  -0.005803 3.014421 -2.187765
N  5.00291 -0.398562 0.787767
N  -4.99412 -0.416585 0.799638
N  3.694692 -0.647751 -1.760822
N  -3.69468 -0.656563 -1.753926
C  5.34933 -0.652063 2.206215
C  6.222545 -0.313904 -0.067757
C  -5.335003 -0.67392 2.218746
C  -6.216951 -0.332012 -0.051313
C  3.851918 0.34877 0.478645
C  -3.846216 0.334628 0.48822
C  6.20981 -1.928452 2.298806
C  7.05492 -1.598413 0.070369
C  -6.192937 -1.952019 2.311424
C  -7.046668 -1.618219 0.086867
C  1.5114 1.810107 -0.126709
C  -1.512418 1.804168 -0.122754
C  3.220794 0.239739 -0.8206
C  -3.219621 0.230139 -0.813555
C  3.234344 1.198249 1.444767
C  -3.227524 1.183696 1.453942
C  2.062757 0.99987 -1.123737
C  -2.064969 0.994299 -1.119418
C  2.069361 1.932307 1.155925
C  -2.065879 1.921937 1.162249
C  4.14608 -1.485288 -2.504804
C  -4.1467 -1.493982 -2.497667
H  4.42412 -0.803115 2.790077
H  5.910647 0.204083 2.64492
H  6.836181 0.552235 0.266201
H  5.951171 -0.146529 -1.119919
H  -5.896329 0.180194 2.661407
H  -4.407404 -0.824608 2.79891
H  -5.949535 -0.161944 -1.104073
H  -6.830808 0.532417 0.286663
H  6.560569 -2.085257 3.332111
H  5.606674 -2.80297 1.972612
H  6.481959 -2.466603 -0.318057
H  8.008424 -1.51025 -0.474394
H  -5.589516 -2.824732 1.980956
H  -6.539633 -2.111874 3.345632
H  -8.002258 -1.530461 -0.454293
H  -6.473571 -2.484529 -0.305542
H  3.703602 1.318027 2.425167
H  -3.693398 1.299834 2.436396
H  1.613443 0.947228 -2.120516
H  -1.619183 0.945252 -2.117966
H  1.633285 2.624025 1.883785
H  -1.629213 2.613429 1.889965
