program: Gaussian 09
title: 000285989
version: EM64L-G09RevD.01
frameworkgroup: C1[X(C16H13N3O3S2)]
method: RPBEPBE
basis: SDD
operation: Freq
keyword: #p
keyword: freq=noraman
keyword: PBEPBE/SDD
title: #p freq=noraman PBEPBE/SDD
converged: YES YES NO NO
title: Mulliken charges:
elementType: S S O O O N N N C C C C C C C C C C C C C C C C H H H H H H H H H H H H H
charge: 0.304412 0.309444 -0.294044 -0.437773 -0.209296 -0.396636 -0.108766 0.021413 -0.397701 -0.390973 -0.165396 0.525729 0.156437 -0.656376 0.270130 -0.411087 -0.348835 -0.333661 0.224253 -0.611727 -0.223499 -0.245818 -0.230254 0.117692 0.259817 0.233198 0.230677 0.266777 0.356473 0.310170 0.276625 0.213224 0.304669 0.231015 0.229238 0.230933 0.389516
chargesum: 0.00000
title: Mulliken charges with hydrogens summed into heavy atoms:
elementType: S S O O O N N N C C C C C C C C C C C C C C C C
charge: 0.304412 0.309444 -0.294044 -0.048257 -0.209296 -0.040163 -0.108766 0.021413 0.095314 0.106481 -0.165396 0.525729 0.156437 -0.346205 0.270130 -0.411087 -0.072210 -0.120438 0.224253 -0.307058 0.007515 -0.016581 0.000679 0.117692
polarizability: 3.10917703e+02 -1.72656008e+01 3.04629915e+02 -2.31412413e+01 -9.58568552e+00 1.20705064e+02
1716.lowfreq: -3.3315 -2.4859 -0.0013 -0.0012 0.0002 3.8924 13.0714 18.0492 23.7094
frequency: 13.0601 17.9668 23.6957 34.8225 44.5319 50.5889 57.8949 81.0569 92.6817 109.2778 148.9335 170.0708 173.6365 211.8381 227.0335 255.8911 265.5206 281.4292 310.8230 338.2060 357.6452 398.9536 401.6890 415.3672 463.2921 477.6869 483.5253 499.5562 518.4385 556.6204 572.6756 587.8566 614.2713 622.3577 632.6128 653.1752 663.4937 679.2034 688.2606 692.8535 704.1150 732.6925 737.5840 793.3091 798.9763 803.5785 806.2264 827.4574 844.2195 856.4403 866.1368 904.2989 937.9232 966.7140 986.2280 987.6202 989.8821 1007.6039 1010.9091 1021.0179 1035.1908 1059.6397 1075.2131 1087.7451 1111.0557 1154.5337 1164.2128 1172.3416 1189.8199 1201.8560 1241.4857 1250.4932 1282.7187 1295.9751 1320.8245 1332.7297 1347.2713 1360.7926 1385.1334 1432.5364 1438.7254 1456.4545 1464.4409 1467.5266 1471.2456 1506.0854 1519.7398 1568.9376 1580.4118 1605.7342 1611.4502 1670.1568 2988.3400 2998.8855 3046.9235 3079.6000 3120.5313 3130.9623 3144.0601 3157.4620 3168.8630 3252.3274 3257.3404 3525.4044 3536.5955
redmass: 7.4062 7.0953 5.1907 7.0255 8.3940 10.7457 6.2023 4.6413 10.3263 7.5407 4.9013 6.1066 7.0491 4.1858 6.1557 5.1333 10.6768 6.7451 3.3296 6.9002 4.7607 7.2783 3.3213 4.0481 3.1442 4.6785 4.7143 6.5866 3.6338 7.9249 2.1295 6.1994 6.3879 3.0544 4.4336 2.5976 2.5983 3.6001 3.2777 3.4785 1.5559 6.8492 4.2654 2.5777 3.7044 1.4594 4.2415 1.4966 5.0172 1.2701 2.8699 8.9714 1.4389 2.9378 1.4051 3.7369 5.1121 1.3401 3.4560 2.7538 2.0813 2.8465 2.5229 1.7928 1.3478 2.4256 1.9202 1.0651 1.1158 1.2123 1.5501 1.7154 1.9408 4.1729 1.3563 1.5219 7.2757 1.3601 8.9606 2.2127 1.1646 8.4057 1.2163 7.4608 1.8294 2.0779 6.0556 6.7861 10.4894 6.5740 6.0077 9.3376 1.0628 1.0633 1.0980 1.0995 1.0862 1.0875 1.0923 1.0957 1.1004 1.0963 1.0959 1.0777 1.0644
irintensity: 0.5220 0.6465 0.5698 0.8632 2.3128 1.9283 5.2005 1.3082 5.2364 1.3764 0.7857 1.2801 0.7145 3.7618 2.7527 8.3009 0.5204 1.6054 5.9874 1.8191 5.5656 3.1667 0.4642 7.8148 0.9063 6.5264 8.1530 21.8482 18.0357 3.0815 58.4000 18.1935 0.4671 71.7608 68.0535 52.1265 47.7977 1.4483 3.5406 12.8120 102.7541 45.8319 25.7005 19.6957 2.7633 40.5739 18.6503 43.9626 10.1952 0.9562 14.8984 36.0154 3.3950 56.5475 0.7384 18.0004 5.1791 0.6324 292.0193 35.1088 18.0001 27.2335 40.5349 53.3999 84.7742 25.2807 3.0156 1.7056 23.7874 12.0413 2.2667 1.8214 175.0345 72.0559 10.7718 11.8784 25.0957 15.1120 2.2032 0.4917 24.0395 12.3029 70.3969 15.0600 105.2250 270.7531 14.2337 121.2228 47.3117 61.8912 7.3645 319.5880 10.9436 38.3926 21.5014 3.7668 7.5796 3.5053 28.6252 14.9778 21.1596 11.1753 13.1965 129.9882 56.7584
temp: 298.150 k
press: 1.00000 atm
elementType: 16 16 8 8 8 7 7 7 6 6 6 6 6 6 6 6 6 6 6 6 6 6 6 6 1 1 1 1 1 1 1 1 1 1 1 1 1
symmnumber: 1
zpe: 692286.1 jmol-1
zpe.correction: 0.263678 hartree
zpe.thermalcorrener: 0.285566 hartree
zpe.thermalcorrenthalpy: 0.286510 hartree
zpe.thermalcorrgfe: 0.207692 hartree
zpe.sumelectzpe: -1801.868772 hartree
zpe.sumelectthermal: -1801.846884 hartree
zpe.sumelectthermalent: -1801.845940 hartree
zpe.sumelectthermalfe: -1801.924757 hartree
dipole: 1.7183 -0.9363 0.2469
dipole: 1.9723
quadrupole: -181.6503 -124.4200 -155.4497
quadrupole: -5.2644 7.3673 0.7063
quadrupole: -27.8103 29.4200 -1.6097 -5.2644 7.3673 0.7063
hfenergy: -1802.1324496 hartree
pointgroup: C01 [X(C16H13N3O3S2)]
dipole: 0.6852643 -0.3231779 0.1676378 debye
polarizability: 312.927601|-19.6377011|295.0598391|-15.6060697|-39.9723709|128.2652432 unknown
InChI: InChI=1S/C16H13N3O3S2/c20-14(10-4-2-1-3-5-10)17-7-6-13-18-11(8-23-13)15-19-12(9-24-15)16(21)22/h1-5,8-9,17,21H,6-7H2
charge 0 multiplicity 1
37 atoms
S  0.87095 4.107661 -1.378798
S  1.5012 -0.675713 1.102412
O  -4.880852 1.07035 0.407475
O  5.692473 -2.416298 1.014248
O  6.398676 -0.551814 -0.194202
N  -2.563053 1.201504 0.544004
N  0.21049 1.896445 -0.054328
N  3.639977 0.446108 -0.065256
C  -1.797613 3.379551 -0.431181
C  -2.541479 2.654529 0.7207
C  -0.341885 3.004834 -0.519496
C  1.592325 1.818891 -0.317178
C  -3.742659 0.49749 0.369078
C  2.126929 2.897433 -1.012946
C  -3.613418 -0.989686 0.139574
C  2.352777 0.665013 0.134955
C  -4.793938 -1.766919 0.257265
C  -2.394217 -1.631589 -0.204682
C  4.063653 -0.761128 0.503763
C  3.079262 -1.496521 1.161216
C  -4.756832 -3.161678 0.053076
C  -2.358404 -3.027817 -0.413485
C  -3.537476 -3.797523 -0.280812
C  5.482013 -1.175213 0.379571
H  -2.297492 3.13514 -1.389552
H  -1.890646 4.473311 -0.292779
H  -2.065191 2.911699 1.685971
H  -3.592448 2.989651 0.748881
H  -1.650256 0.740375 0.537415
H  3.162012 3.038009 -1.314887
H  -5.725698 -1.247183 0.503214
H  -1.468493 -1.058969 -0.33999
H  3.203532 -2.451468 1.665644
H  -5.674284 -3.752377 0.150982
H  -1.414511 -3.512488 -0.68646
H  -3.507142 -4.880814 -0.443013
H  6.649916 -2.6660 0.915603
