program: Gaussian 09
title: 000285959
version: EM64L-G09RevD.01
frameworkgroup: C1[X(C16H14Br2)]
method: RPBEPBE
basis: SDD
operation: Freq
keyword: #p
keyword: freq=noraman
keyword: PBEPBE/SDD
title: #p freq=noraman PBEPBE/SDD
converged: NO NO NO NO
title: Mulliken charges:
elementType: Br Br C C C C C C C C C C C C C C C C H H H H H H H H H H H H H H
charge: 0.005599 0.005606 -0.082497 0.324696 0.324708 0.299466 -0.370578 -0.370683 -0.370610 -0.370610 -0.784182 -0.784146 -0.181527 -0.181476 -0.181500 -0.181483 -0.221608 -0.221626 0.237419 0.237440 0.237403 0.237378 0.222061 0.222038 0.252537 0.222048 0.222041 0.252539 0.249889 0.249885 0.249888 0.249884
chargesum: 0.00000
title: Mulliken charges with hydrogens summed into heavy atoms:
elementType: Br Br C C C C C C C C C C C C C C C C
charge: 0.005599 0.005606 -0.082497 0.324696 0.324708 0.299466 -0.133159 -0.133243 -0.133207 -0.133232 -0.087546 -0.087518 0.068362 0.068409 0.068387 0.068401 -0.221608 -0.221626
polarizability: 2.71889821e+02 -4.75480628e-03 1.88600373e+02 -7.18272556e-02 -4.65196837e-02 1.60519962e+02
1716.lowfreq: -43.3547 -22.2149 -0.0004 -0.0002 0.0003 3.0815 6.1782 7.9653 18.9464
frequency: -43.3332 -22.1955 18.9464 59.8963 65.4088 101.5254 113.4001 121.1167 131.5709 170.9234 176.3518 198.2982 240.8984 253.8989 307.8149 316.6806 341.1481 371.5735 398.2498 398.4705 405.0906 405.6021 465.6704 497.6387 552.3738 603.6712 620.1165 659.4919 683.2202 703.2151 709.9164 728.9272 815.0691 826.4809 829.0183 835.9477 889.7996 900.5834 950.1894 952.2897 957.7992 965.8296 966.4534 971.2438 994.9856 995.5072 1054.7368 1059.8937 1069.1513 1082.9707 1101.5116 1106.6110 1183.6653 1187.1395 1201.0666 1233.2063 1285.5936 1291.9102 1295.5472 1336.5342 1346.6426 1379.2473 1382.8805 1390.7749 1401.7034 1460.8467 1461.0771 1463.2732 1467.5901 1471.3844 1477.6606 1563.4673 1566.5734 1587.0226 1588.4624 1675.9166 2963.2735 2967.5415 3032.2234 3036.1092 3094.0020 3096.2152 3135.2670 3137.1589 3137.9706 3139.1670 3163.5428 3163.9132 3167.2642 3167.7354
redmass: 3.6713 3.7367 19.2145 5.5596 4.6706 2.9021 1.0214 8.8748 5.2137 1.0921 6.1928 8.0512 4.9679 8.8533 4.8698 4.1933 3.5885 4.6136 2.6830 2.8638 4.3508 2.7781 3.6588 3.1915 2.9384 6.5253 7.1370 6.1428 7.0567 5.8106 3.9509 3.8204 1.5459 1.7332 1.2471 1.2424 2.7978 4.0514 1.3357 1.4922 1.3594 1.3586 1.2615 1.3623 5.1057 4.8971 2.9332 2.4295 1.7182 1.6590 1.4026 1.3933 1.1097 1.1156 3.0451 4.1592 1.2584 1.2523 4.3648 4.8615 5.7964 3.5550 3.3421 1.2630 1.2108 1.0514 1.0502 1.6507 2.4595 1.3501 1.0448 7.5475 7.6176 6.3751 6.2106 7.3816 1.0388 1.0386 1.0967 1.0961 1.0969 1.0971 1.0890 1.0888 1.0890 1.0888 1.0956 1.0958 1.0968 1.0970
irintensity: 0.0000 0.0714 0.0589 0.0642 0.0538 0.0000 0.0000 0.1003 0.3050 1.2155 0.0000 1.0413 0.1187 2.7728 0.9283 0.0000 0.2090 0.0199 2.3749 0.0125 5.6085 2.0151 15.9820 30.7420 32.7653 0.0550 0.0000 4.8652 1.9019 7.3741 0.1902 0.8488 58.1747 78.8857 0.0042 0.1205 5.8052 25.5473 1.4745 0.3246 0.5295 0.0000 0.0000 0.1363 48.7660 89.1437 0.0308 46.6315 49.5236 0.7814 0.0000 18.7731 0.1461 0.0036 5.7826 2.4786 0.0000 0.3258 0.0169 0.0000 0.5862 0.0003 13.2401 11.4465 21.0691 10.7002 0.0046 14.7849 116.2402 29.7685 15.5520 0.0000 0.0000 14.7463 7.6928 10.9086 13.0847 71.5450 0.0003 34.9524 26.6358 20.9198 0.0011 16.4271 8.4182 4.2135 0.0073 21.9901 0.1834 0.0320
temp: 298.150 k
press: 1.00000 atm
elementType: 35 35 6 6 6 6 6 6 6 6 6 6 6 6 6 6 6 6 1 1 1 1 1 1 1 1 1 1 1 1 1 1
symmnumber: 1
zpe: 641484.0 jmol-1
zpe.correction: 0.244328 hartree
zpe.thermalcorrener: 0.260627 hartree
zpe.thermalcorrenthalpy: 0.261571 hartree
zpe.thermalcorrgfe: 0.197830 hartree
zpe.sumelectzpe: -643.740097 hartree
zpe.sumelectthermal: -643.723799 hartree
zpe.sumelectthermalent: -643.722854 hartree
zpe.sumelectthermalfe: -643.786596 hartree
dipole: -0.0010 3.1642 -0.0001
dipole: 3.1642
quadrupole: -143.6346 -122.4758 -111.7698
quadrupole: -0.0040 -0.0131 -0.0115
quadrupole: -17.6745 3.4843 14.1903 -0.0040 -0.0131 -0.0115
hfenergy: -643.9844255 hartree
pointgroup: C01 [X(C16H14Br2)]
dipole: -0.0151733 1.2447941 0.000034 debye
polarizability: 271.8766556|1.0470713|188.6135382|-0.0724038|0.0456171|160.5199617 unknown
InChI: InChI=1S/C16H14Br2/c1-11(2)16(12-3-7-14(17)8-4-12)13-5-9-15(18)10-6-13/h3-10H,1-2H3
charge 0 multiplicity 1
32 atoms
Br 5.277994 -2.302473 -0.000293
Br -5.229345 -2.434039 0.000762
C  -0.019434 1.123723 -0.00017
C  1.260543 0.322715 -0.000219
C  -1.279957 0.292463 -0.000016
C  -0.035615 2.493447 -0.000139
C  1.868778 -0.079282 -1.218496
C  -1.878601 -0.12338 1.218363
C  1.867596 -0.081163 1.218027
C  -1.875936 -0.127942 -1.218136
C  -1.322249 3.299063 -0.000107
C  1.231564 3.329283 -0.000082
C  3.052469 -0.851566 -1.2288
C  -3.042245 -0.925532 1.228882
C  3.05128 -0.853452 1.228287
C  -3.039569 -0.930103 -1.228189
C  3.63109 -1.230666 -0.000269
C  -3.61027 -1.320681 0.00046
H  1.418706 0.219291 -2.171777
H  -1.436677 0.187441 2.171549
H  1.416547 0.215868 2.171328
H  -1.431953 0.179292 -2.171526
H  -1.366936 3.959932 0.888282
H  -1.365788 3.961779 -0.887163
H  -2.224318 2.665883 -0.001306
H  1.260072 3.991882 -0.887835
H  1.259943 3.991936 0.887641
H  2.148226 2.717463 0.00001
H  3.512568 -1.149329 -2.175885
H  -3.495131 -1.233897 2.176053
H  3.51046 -1.152681 2.175356
H  -3.490413 -1.241974 -2.175187
