program: Gaussian 09
title: 000285937
version: EM64L-G09RevD.01
frameworkgroup: C1[X(C13H7ClOS)]
method: RPBEPBE
basis: SDD
operation: Freq
keyword: #p
keyword: freq=noraman
keyword: PBEPBE/SDD
title: #p freq=noraman PBEPBE/SDD
converged: NO YES NO YES
title: Mulliken charges:
elementType: Cl S O C C C C C C C C C C C C C H H H H H H H
charge: -0.099165 0.316351 -0.110922 0.454735 0.452420 -0.557808 -0.367696 0.505354 -0.386784 -0.362993 -0.293771 -0.339268 -0.228138 -0.236074 -0.233035 -0.212949 0.242463 0.233537 0.250666 0.265853 0.239382 0.232416 0.235426
chargesum: 0.00000
title: Mulliken charges with hydrogens summed into heavy atoms:
elementType: Cl S O C C C C C C C C C C C C C
charge: -0.099165 0.316351 -0.110922 0.454735 0.452420 -0.557808 -0.367696 0.505354 -0.144320 -0.129456 -0.043105 -0.073414 0.011244 -0.003658 0.002391 -0.212949
polarizability: 2.89839231e+02 -1.37881661e+01 1.83794068e+02 5.85500748e-05 -3.33744836e-03 6.08360689e+01
1716.lowfreq: -5.4520 -0.0012 0.0018 0.0024 4.9941 9.0831 39.0827 82.2904 113.4264
frequency: 39.0665 82.2903 113.4226 118.0387 175.7626 228.4428 228.6894 231.9257 279.8501 361.1365 398.5074 420.1294 429.6428 460.1331 481.8796 501.2275 514.9838 531.4964 564.9962 628.3151 661.7865 676.1764 686.4485 726.2414 738.7058 753.4603 767.9390 823.1978 869.1695 915.6508 936.8220 950.7300 988.0446 992.0460 1019.1785 1030.7986 1042.2233 1094.1644 1106.0302 1135.4877 1175.7976 1189.6879 1239.8078 1258.4001 1323.0108 1371.8696 1388.4090 1407.1927 1436.1521 1441.7527 1475.1878 1562.9779 1578.7596 1590.5838 1608.5728 1683.3781 3131.8373 3139.7090 3142.3601 3156.1852 3161.6670 3171.0537 3181.3240
redmass: 12.8515 9.4589 4.3818 10.4738 4.6156 17.2311 6.5430 6.0351 4.8093 11.7588 8.7045 15.8559 3.1047 4.9215 9.5331 4.1017 6.4650 8.2670 3.8133 7.3417 6.5015 7.1262 7.5197 2.7569 2.2277 6.9400 1.4862 1.8892 1.4189 7.8265 1.4191 1.3961 1.3398 1.3626 4.0576 2.9304 5.5945 3.1395 1.7752 1.5768 1.0748 1.2600 2.2625 1.5824 2.2857 2.9862 7.0988 6.1590 2.3504 2.5618 3.2752 6.9810 6.9922 6.3644 6.6827 12.9247 1.0864 1.0883 1.0891 1.0948 1.0921 1.1006 1.0970
irintensity: 0.0109 0.1087 1.9834 3.7234 0.6128 6.7934 1.7706 3.1877 0.0004 0.2214 1.3496 22.2679 7.0654 0.9694 1.1141 5.9809 4.4171 1.5061 0.0657 39.9311 9.6748 36.5917 120.1507 7.2965 12.7875 32.7448 109.5136 27.2800 0.0070 143.0578 0.0668 1.4219 0.1040 0.5047 25.5544 8.2945 16.9938 46.9518 32.5701 20.5560 1.1767 25.3831 126.2035 12.1441 22.5391 45.0945 17.3306 11.7841 33.0205 23.9431 6.2959 44.6702 5.9668 2.6626 7.5908 197.7704 1.5808 4.2478 3.2938 15.0078 11.7260 27.8952 6.9509
temp: 298.150 k
press: 1.00000 atm
elementType: 17 16 8 6 6 6 6 6 6 6 6 6 6 6 6 6 1 1 1 1 1 1 1
symmnumber: 1
zpe: 415821.4 jmol-1
zpe.correction: 0.158378 hartree
zpe.thermalcorrener: 0.170933 hartree
zpe.thermalcorrenthalpy: 0.171877 hartree
zpe.thermalcorrgfe: 0.118554 hartree
zpe.sumelectzpe: -1431.881671 hartree
zpe.sumelectthermal: -1431.869116 hartree
zpe.sumelectthermalent: -1431.868172 hartree
zpe.sumelectthermalfe: -1431.921495 hartree
dipole: 4.5094 3.7347 0.0010
dipole: 5.8552
quadrupole: -102.5886 -96.4523 -110.4465
quadrupole: -8.5472 -0.0008 -0.0025
quadrupole: 0.5739 6.7101 -7.2841 -8.5472 -0.0008 -0.0025
hfenergy: -1432.0400493 hartree
pointgroup: C01 [X(C13H7Cl1O1S1)]
dipole: 1.7356113 1.5146643 0.0001545 debye
dipolederiv: -1.3341868 0.0442331 -0.0108883 0.2374163 -0.1998548 0.0026616 -0.0132303 0.0009705 -0.1435814 -0.2718231 0.1361429 -0.0046297 0.3437456 -0.1180704 0.0052507 -0.0066492 0.0034397 0.1078269 -0.735478 0.0432901 -0.0049657 0.0056186 -0.9785818 0.0078519 -0.0044639 0.0076991 -0.2209418 0.2961316 -0.2422531 0.0045182 0.2289583 -0.3895261 0.0064701 -0.0002845 0.0024198 0.0547035 -0.015687 0.0475759 -0.0009007 -0.2126286 -0.134685 -0.0001518 0.0016593 0.002106 0.0297484 0.0715718 -0.0323837 0.0019219 -0.780273 0.4748004 -0.0127029 0.0096167 -0.0061963 -0.1148516 0.591054 0.1753637 0.0041227 0.31933 -0.048668 0.0022955 0.0026355 0.0010414 -0.0913989 -0.7094951 -0.263163 -0.0039779 -0.4484804 -0.4871138 0.0015304 -0.002069 0.0031922 0.0508633 0.2814282 0.007737 0.0032868 -0.1589744 0.1263369 -0.0037676 0.0050101 -0.0022977 -0.1098365 0.0311063 -0.0470435 0.001967 0.0295167 0.0898988 -0.0020776 0.0012153 -0.0027511 -0.1391255 -0.2738694 -0.0619896 -0.0006571 -0.1696155 0.1185203 -0.0039486 0.0004268 -0.0030071 -0.1238971 -0.054762 0.0244047 0.0002678 0.5052026 0.162925 0.0015503 -0.0044484 -0.0025847 -0.1139528 -0.5062747 -0.1256404 -0.0018001 -0.2279344 0.1081017 -0.004585 -0.0007428 -0.0037298 -0.1515604 0.0073572 0.1238459 0.0002295 0.12016 -0.0672503 0.0000613 0.000238 0.0001136 -0.1626982 0.0327437 -0.0219843 0.0019097 0.0291291 0.0677108 -0.0020358 0.0014149 -0.0024897 -0.1528779 2.4842127 0.1881264 0.0183525 0.172667 1.2949459 -0.009946 0.0185485 -0.0094646 0.1756289 0.0171587 -0.1120897 0.0000473 -0.0701129 0.0095234 0.0007542 -0.0003685 0.0003962 0.1438649 0.0885254 0.047179 -0.0010323 -0.0147493 -0.0875159 0.002324 -0.0003963 0.0028392 0.1521501 0.0989162 -0.0289879 -0.0002786 0.035023 -0.0606315 0.0026061 -0.0009499 0.0020576 0.1639181 0.0280118 0.040074 -0.0015315 0.0250538 0.1199844 0.0006071 -0.0013977 0.000756 0.158326 0.0520364 0.0577911 -0.0015283 0.0559215 -0.0839543 0.0029544 -0.001546 0.0029772 0.1609685 -0.0817296 -0.0824857 -0.0012948 -0.1044717 0.0317993 0.0004398 -0.0010935 0.0006304 0.1633783 -0.0969483 0.0822573 -0.0031383 0.0794978 0.0513052 0.0018582 -0.0031249 0.0018824 0.1633454 unknown
polarizability: 290.4620309|-11.0164816|183.1395262|2.1021861|-1.3344419|60.8678103 unknown
InChI: InChI=1S/C13H7ClOS/c14-13(15)10-6-3-5-9-8-4-1-2-7-11(8)16-12(9)10/h1-7H
charge 0 multiplicity 1
23 atoms
Cl -4.894479 -0.583808 -0.03975
S  0.085601 -1.809939 0.016118
O  -2.751754 -2.258217 -0.004217
C  0.242428 0.892051 -0.009926
C  1.629383 0.426431 0.006629
C  -0.706199 -0.178317 -0.007121
C  1.724076 -0.995015 0.02192
C  -2.108826 0.082316 -0.021803
C  -0.225118 2.227129 -0.027422
C  2.823065 1.191413 0.009158
C  2.963023 -1.663019 0.039619
C  -2.542769 1.43547 -0.039258
C  -1.61056 2.493473 -0.041966
C  4.069558 0.536276 0.026737
C  4.140276 -0.882371 0.041962
C  -3.041069 -1.058395 -0.018237
H  0.491691 3.055618 -0.029647
H  2.77769 2.286069 -0.002399
H  3.019006 -2.755921 0.051333
H  -3.616564 1.640051 -0.05066
H  -1.967009 3.52785 -0.055502
H  4.993247 1.124262 0.028804
H  5.116504 -1.378505 0.05573
