program: Gaussian 09
title: 000285924
version: EM64L-G09RevD.01
frameworkgroup: C1[X(C10H6N2O5)]
method: RPBEPBE
basis: SDD
operation: Freq
keyword: #p
keyword: freq=noraman
keyword: PBEPBE/SDD
title: #p freq=noraman PBEPBE/SDD
converged: NO YES NO NO
title: Mulliken charges:
elementType: O O O O O N N C C C C C C C C C C H H H H H H
charge: -0.412887 -0.192110 -0.204257 -0.193028 -0.202477 0.023794 0.020959 0.225603 0.515426 0.264838 -0.577664 -0.316412 -0.631083 0.409682 -0.515661 0.338292 -0.399598 0.297852 0.313961 0.253705 0.317888 0.293455 0.369721
chargesum: 0.00000
title: Mulliken charges with hydrogens summed into heavy atoms:
elementType: O O O O O N N C C C C C C C C C C
charge: -0.043166 -0.192110 -0.204257 -0.193028 -0.202477 0.023794 0.020959 0.225603 0.515426 0.264838 -0.279811 -0.002451 -0.377378 0.409682 -0.197773 0.338292 -0.106143
polarizability: 2.48735369e+02 1.13949064e+01 1.80205004e+02 4.98632614e-03 2.53386222e-03 5.22929902e+01
1716.lowfreq: -32.0148 -8.2690 -4.7697 -1.4777 -0.0005 -0.0003 -0.0002 48.2906 69.7673
frequency: -31.7978 48.2639 69.7614 103.8993 144.9855 171.3339 218.2697 252.0396 275.7744 305.5913 311.7400 361.3304 387.4084 415.7805 423.8676 452.2737 490.2084 511.7110 543.5629 548.2875 614.6528 632.1623 644.0166 701.8404 703.9177 725.8808 744.8788 775.2723 778.0286 858.7454 863.8978 894.0202 939.4452 948.7587 957.5023 1000.6862 1013.2760 1087.5621 1125.8370 1145.3748 1167.4753 1188.4813 1205.0279 1220.3074 1256.9104 1286.3322 1329.5812 1371.8865 1378.2459 1408.8616 1433.1434 1436.8693 1459.1034 1529.6311 1589.9673 1608.1046 1635.2027 3127.8929 3166.7789 3184.9250 3191.9779 3221.2739 3584.0578
redmass: 15.2183 13.8126 8.4358 5.2732 11.2290 5.6623 10.3529 5.2016 8.0651 4.3553 11.0198 8.7952 1.1393 8.5405 3.8265 7.6173 7.7123 4.1378 5.5916 5.5065 2.9129 7.5133 7.5936 5.3821 7.5825 9.5951 7.4741 3.3968 7.5892 1.3855 1.6869 7.2426 1.4694 1.6137 6.1685 4.1200 1.3257 2.0883 1.5658 1.5473 1.5107 7.7782 2.2444 3.2109 2.2752 2.0442 2.2834 8.3019 8.4594 7.4053 4.5088 4.1597 3.3087 5.0897 8.1530 6.5108 7.3179 1.0925 1.0924 1.0915 1.0919 1.0938 1.0663
irintensity: 0.0428 0.7814 4.3508 0.0033 5.0782 0.8602 0.2788 0.1901 2.3773 0.0376 1.4471 1.2085 151.7948 7.8347 2.1271 0.8470 8.2663 28.0579 0.6176 8.1451 5.5029 12.3322 5.4359 7.4511 5.4263 32.4682 37.9126 4.4523 10.4875 43.5606 8.0010 13.1738 29.3472 32.1980 10.1668 27.9109 0.0807 44.0436 71.6392 231.9828 23.5499 361.2514 56.1240 250.2417 11.5699 14.5883 5.3919 52.0449 223.0014 0.8884 10.6968 19.0880 34.4545 27.8005 12.9203 111.8552 31.7424 8.6705 2.3697 6.4140 14.8600 7.5598 73.2556
temp: 298.150 k
press: 1.00000 atm
elementType: 8 8 8 8 8 7 7 6 6 6 6 6 6 6 6 6 6 1 1 1 1 1 1
symmnumber: 1
zpe: 395807.7 jmol-1
zpe.correction: 0.150755 hartree
zpe.thermalcorrener: 0.163479 hartree
zpe.thermalcorrenthalpy: 0.164423 hartree
zpe.thermalcorrgfe: 0.110988 hartree
zpe.sumelectzpe: -868.932332 hartree
zpe.sumelectthermal: -868.919608 hartree
zpe.sumelectthermalent: -868.918664 hartree
zpe.sumelectthermalfe: -868.972099 hartree
dipole: 1.4778 4.9809 -0.0063
dipole: 5.1955
quadrupole: -134.8722 -86.6926 -96.3619
quadrupole: 11.6964 -0.0118 0.0285
quadrupole: -28.8966 19.2829 9.6137 11.6964 -0.0118 0.0285
hfenergy: -869.0830872 hartree
pointgroup: C01 [X(C10H6N2O5)]
dipole: -0.6103105 -1.9508431 -0.0024777 debye
dipolederiv: -0.6139315 -0.7082423 0.0002753 -0.9151797 -1.076022 0.0000923 0.0004694 0.0001746 -0.4156322 -1.0278793 0.1669546 -0.0015147 0.1686456 -0.452759 -0.0004803 0.0018044 -0.0006186 -0.2194882 -0.4670843 -0.0701829 0.0001135 0.0494807 -0.7940006 -0.0000351 -0.0003915 -0.0019419 -0.2192094 -0.818347 -0.2248691 0.0000225 -0.1700118 -0.6189185 0.0001181 -0.0000531 0.00005 -0.2201558 -0.7861018 0.1553291 -0.0000738 0.2740843 -0.6502194 0.0000871 -0.0002096 0.000164 -0.2249045 1.4458524 -0.3398358 0.0012897 -0.610449 1.446056 0.0012507 -0.0005557 0.0017 0.1870975 1.9926335 0.0828145 0.0000997 -0.1273161 1.0532222 -0.0001903 0.0003231 -0.0002014 0.189895 0.1926441 -0.0370718 -0.0002079 0.1561508 -0.1673452 -0.0000704 -0.0000646 0.0001412 0.0161271 -0.0681839 0.2284766 -0.0000653 0.105263 0.0332916 -0.0000035 -0.0001095 0.0000941 0.0733047 -0.0650272 0.1246865 0.0000385 0.4957954 -0.4652478 -0.000572 -0.0002656 0.0001613 0.0527457 0.2503818 -0.0905934 0.0000192 0.1905873 -0.0321872 0.0000524 -0.0001337 -0.0000868 -0.12741 -0.3020251 -0.0320934 0.0001467 -0.0237378 0.0824259 -0.0001276 0.0001561 0.0000818 -0.1117066 -0.0907421 -0.5191863 0.0001624 0.055233 -0.0978654 -0.0001169 -0.0000628 -0.0001048 -0.1854181 -0.6932851 -0.0887116 0.0000004 -0.1482029 0.0538976 -0.0000746 -0.0000887 0.0000009 0.0765588 -0.08243 0.0890444 0.0001664 -0.574899 0.028404 -0.0000235 -0.000285 0.0005818 -0.081467 0.323188 0.9629414 -0.0002433 1.1014576 1.0091089 -0.0002659 -0.0006738 -0.000208 0.0884423 0.0404322 0.0666169 -0.0000721 -0.2076074 0.014064 -0.0000539 0.0002172 -0.0000554 -0.1237275 0.1294971 0.0069404 0.0000105 0.0213651 0.0388207 0.0000545 0.0001023 0.0000087 0.1687372 0.1587401 0.0419147 -0.0000353 -0.0284837 0.0705023 0.0001147 -0.0001862 -0.0000305 0.1638163 0.0680232 0.0600193 -0.0000349 0.0036315 -0.0524597 0.0001057 -0.0000426 0.0001406 0.1710904 0.1238319 -0.0125184 -0.0000155 0.0088305 0.1551578 0.0000341 0.0000668 -0.0000462 0.1753534 0.1070461 -0.0580199 0.0000371 -0.0119095 0.0802658 0.0000415 0.0000042 0.0000063 0.1715095 0.1827669 0.1955865 -0.0001192 0.1872723 0.3418079 0.0000631 -0.0000211 -0.0000116 0.3944414 unknown
polarizability: 249.0573004|10.3768086|179.883072|-0.0050232|-0.0024599|52.2929902 unknown
InChI: InChI=1S/C10H6N2O5/c13-8-4-6-3-7(11(14)15)1-2-9(6)10(5-8)12(16)17/h1-5,13H
charge 0 multiplicity 1
23 atoms
O  -2.917877 -3.064989 0.000482
O  -3.954258 1.64722 0.00041
O  -2.044519 2.864177 0.0035
O  4.587357 0.995002 -0.00024
O  4.344889 -1.271492 0.000309
N  -2.666567 1.733023 -0.001627
N  3.864363 -0.0731 -0.000167
C  -0.432236 0.421476 -0.000712
C  0.163868 -0.909588 -0.000052
C  -1.879758 0.459645 -0.000919
C  1.586469 -1.048128 -0.00001
C  0.448292 1.557123 -0.001335
C  -0.648958 -2.086437 0.000426
C  2.387697 0.089807 -0.00046
C  -2.658668 -0.699612 -0.000528
C  -2.041929 -1.980133 0.000135
C  1.834033 1.400569 -0.001108
H  2.052346 -2.038006 0.000318
H  0.018996 2.557407 -0.001839
H  -0.157296 -3.067218 0.000944
H  -3.748434 -0.623187 -0.000752
H  2.504199 2.263545 -0.001346
H  -2.43491 -3.928606 0.000973
