program: Gaussian 09
title: 000003846
version: EM64L-G09RevD.01
frameworkgroup: C1[X(C26H24N6O2)]
method: RPBEPBE
basis: SDD
operation: Freq
keyword: #p
keyword: freq=noraman
keyword: PBEPBE/SDD
title: #p freq=noraman PBEPBE/SDD
converged: YES YES NO NO
title: Mulliken charges:
elementType: O O N N N N N N C C C C C C C C C C C C C C C C C C C C C C C C C C H H H H H H H H H H H H H H H H H H H H H H H H
charge: -0.265075 -0.426841 -0.217589 -0.031514 -0.031198 -0.132687 -0.359363 -0.012994 0.127632 -0.505465 -0.591657 -0.360620 0.144342 0.537139 0.185089 -0.336920 0.040614 -0.371880 -0.475783 0.303574 -0.467156 -0.336222 -0.695802 -0.411448 -0.348172 0.216216 0.294486 -0.366241 0.247407 -0.389845 -0.358363 -0.235466 -0.080085 -0.241012 0.246689 0.244368 0.234886 0.281016 0.186425 0.224132 0.196728 0.202884 0.261186 0.233712 0.293635 0.261049 0.213756 0.210026 0.219875 0.248851 0.274745 0.224045 0.257528 0.251865 0.233670 0.235088 0.356427 0.360311
chargesum: 0.00000
title: Mulliken charges with hydrogens summed into heavy atoms:
elementType: O O N N N N N N C C C C C C C C C C C C C C C C C C C C C C C C C C
charge: -0.265075 -0.070414 -0.217589 -0.031514 -0.031198 -0.132687 0.000948 -0.012994 0.127632 -0.014408 -0.075755 0.049937 0.144342 0.537139 0.185089 0.062691 0.040614 -0.110694 -0.242071 0.303574 -0.173521 -0.075173 -0.052145 -0.162597 -0.073427 0.216216 0.294486 -0.142196 0.247407 -0.132317 -0.106498 -0.001796 -0.080085 -0.005924
polarizability: 4.20586940e+02 1.85596505e+01 3.54611907e+02 -2.01680244e+01 2.33754230e+01 2.65127114e+02
1716.lowfreq: -4.7483 -0.0005 0.0002 0.0007 3.2560 5.6895 8.8136 16.8694 18.6680
frequency: 7.5474 16.8390 18.6608 28.7143 30.3010 39.7848 50.7521 58.6603 60.8681 71.2627 86.8090 102.9341 112.1360 128.6565 136.6325 163.2080 183.4497 188.9624 207.6253 227.0586 235.5144 238.1789 250.3286 279.9066 303.5506 322.2613 340.1375 341.5026 347.4907 354.5264 379.7529 389.2873 402.8043 410.1918 418.3056 440.9063 451.2245 464.2955 502.7648 515.7858 545.6056 547.9301 558.1768 562.1422 583.5973 610.1071 632.4820 635.4980 646.9180 658.8125 692.2228 702.2616 707.9961 720.3266 723.6192 727.9354 734.1790 746.5401 764.2225 779.6715 782.0395 787.3882 792.0598 813.2164 824.5882 838.7105 848.1171 865.2752 886.5989 895.6540 900.1910 913.5358 913.7547 930.0893 944.7998 952.1209 953.0469 962.1445 973.9236 986.2310 994.4095 994.7252 995.4230 1002.9424 1022.8958 1038.6364 1042.5455 1065.9921 1079.2232 1087.7443 1097.6531 1103.8518 1106.6982 1112.8493 1127.6809 1135.5787 1148.0019 1151.1326 1179.3027 1189.3550 1198.7528 1201.9660 1205.9769 1218.2515 1222.2284 1244.9168 1257.3861 1267.2649 1271.3924 1278.3858 1282.5719 1285.9221 1288.3921 1313.3902 1324.6636 1331.8246 1345.9727 1355.0145 1370.8073 1378.6572 1390.0943 1395.8660 1403.2763 1408.6110 1414.8936 1443.7519 1447.1224 1456.1296 1467.5176 1471.0129 1477.3794 1478.8168 1483.9599 1488.2817 1500.5626 1516.5570 1546.2829 1562.4693 1568.0838 1579.2841 1602.0988 1607.7470 1621.7055 1637.7703 2964.4205 2971.6263 2974.1679 3008.4741 3017.4707 3021.3915 3036.1987 3070.1485 3074.5345 3084.0012 3087.9325 3113.7527 3117.1126 3129.7020 3131.8290 3142.6709 3153.8094 3154.8151 3169.4671 3169.8757 3177.8673 3187.4625 3583.1520 3604.0908
redmass: 6.2716 5.3823 6.4802 4.3622 7.3298 4.9710 4.8949 2.3773 2.8619 4.6118 6.9282 4.2285 5.2111 3.6916 3.6226 5.3184 6.0070 5.5629 4.5790 1.4948 2.2753 5.7964 5.7133 5.3688 7.0754 3.5374 1.1373 4.5075 4.7276 3.7871 3.8074 6.0116 2.9415 2.9101 3.7303 4.2134 3.9412 5.4786 4.3436 4.7098 5.9079 4.7907 3.6071 3.2173 5.0503 4.8355 6.4336 7.2733 5.7278 5.8389 5.0576 6.7373 5.4706 1.3096 3.0393 1.1924 4.6711 3.2408 2.4993 2.7199 2.3616 2.0283 2.2694 3.0450 1.7716 1.9940 1.3300 2.9507 1.5068 2.2098 2.0850 5.4461 1.5074 1.4053 5.5243 1.3491 1.6291 1.3999 1.4041 2.6062 1.5168 4.5859 7.5932 4.1392 2.8292 4.4939 2.8940 2.6303 2.3402 2.0941 5.8062 1.9942 1.9078 2.1660 1.5344 1.4128 2.0401 5.2746 1.0750 1.8004 3.4251 1.2026 1.7184 2.2151 2.4182 1.9237 1.3150 2.0574 1.7816 1.8621 1.8956 1.5174 1.3160 1.4321 1.4185 1.7757 1.5650 5.3640 2.7320 1.9051 1.2125 1.5803 6.1183 2.6972 2.5666 2.7705 2.6782 1.2730 1.0738 1.1168 1.0536 1.0802 3.1291 1.0971 3.1314 3.3578 8.3562 7.4551 6.5689 7.2731 10.2068 6.1663 6.2211 6.9157 1.0592 1.0619 1.0366 1.0969 1.0618 1.0604 1.1015 1.1008 1.0993 1.1012 1.1009 1.0904 1.0901 1.0877 1.0857 1.0894 1.0955 1.0957 1.1011 1.0949 1.0928 1.0939 1.0661 1.0845
irintensity: 0.1120 0.3605 0.5144 0.3032 4.2871 0.3491 0.8899 1.0188 0.5114 0.1238 3.8222 0.3826 2.2669 0.4998 0.4956 0.7080 1.2138 3.4446 0.8819 1.2702 2.1786 1.7743 1.8092 0.8581 1.3690 0.7378 139.4791 3.1982 2.7429 0.7154 3.7636 11.3741 11.4644 4.2578 4.9970 3.6846 2.2372 2.5555 2.5011 5.6282 1.4254 2.5820 13.4192 13.5631 1.3523 5.1193 1.4746 14.4732 21.2138 2.9935 8.5480 3.4209 0.6393 85.7869 40.4251 6.2305 11.1063 36.6903 40.2076 16.9128 24.0271 1.0152 13.0403 5.8048 58.8900 18.4570 3.2475 8.1168 5.0146 37.8545 14.6628 8.3104 13.3335 0.6344 8.6314 2.1616 1.1450 2.3355 0.8435 14.2532 1.8897 10.6163 12.4118 0.2578 1.6429 5.6595 7.0061 3.1994 12.3587 90.0347 7.4795 54.2003 3.0878 10.5261 6.5896 50.0725 45.2077 1.7103 0.0839 59.3289 5.9411 2.5482 9.0506 2.2548 21.7700 11.0975 7.8449 5.5555 36.8479 111.8377 2.8462 10.5987 0.8949 29.3244 2.9494 26.6854 0.4043 8.0947 35.4161 29.6825 12.8326 5.5485 8.3103 16.8920 28.9572 42.6208 42.5476 44.9946 2.4999 13.6611 9.7419 5.3645 127.9505 11.5885 26.4469 5.7178 195.3125 39.9135 0.2625 6.1238 313.0431 5.2338 3.9417 36.8941 7.2173 45.4257 46.9143 2.5424 25.4502 19.7130 24.1181 60.0861 46.6780 25.5787 16.6642 23.1838 21.9339 9.4506 0.1470 6.8002 7.7592 14.8785 26.5664 4.7415 6.2509 1.3937 64.6925 119.0068
temp: 298.150 k
press: 1.00000 atm
elementType: 8 8 7 7 7 7 7 7 6 6 6 6 6 6 6 6 6 6 6 6 6 6 6 6 6 6 6 6 6 6 6 6 6 6 1 1 1 1 1 1 1 1 1 1 1 1 1 1 1 1 1 1 1 1 1 1 1 1
symmnumber: 1
zpe: 1189021.9 jmol-1
zpe.correction: 0.452875 hartree
zpe.thermalcorrener: 0.482414 hartree
zpe.thermalcorrenthalpy: 0.483358 hartree
zpe.thermalcorrgfe: 0.387528 hartree
zpe.sumelectzpe: -1481.720982 hartree
zpe.sumelectthermal: -1481.691442 hartree
zpe.sumelectthermalent: -1481.690498 hartree
zpe.sumelectthermalfe: -1481.786328 hartree
dipole: 1.3004 1.4278 3.7225
dipole: 4.1937
quadrupole: -165.7773 -192.7078 -185.9784
quadrupole: -6.2103 -9.1680 -3.3475
quadrupole: 15.7105 -11.2199 -4.4906 -6.2103 -9.1680 -3.3475
hfenergy: -1482.1738563 hartree
pointgroup: C01 [X(C26H24N6O2)]
dipole: -0.3882406 -0.20986 1.5897888 debye
polarizability: 416.9256573|28.4373303|342.2334793|9.9992974|-43.0565284|281.1668255 unknown
InChI: InChI=1S/C26H24N6O2/c1-2-3-8-24-27-23-14-13-19(33)15-22(23)26(34)32(24)16-17-9-11-18(12-10-17)20-6-4-5-7-21(20)25-28-30-31-29-25/h4-7,9-15,30,33H,2-3,8,16H2,1H3
charge 0 multiplicity 1
58 atoms
O  2.780686 1.387636 -2.629069
O  6.524024 4.193632 -0.472321
N  2.414443 -0.312099 -1.042481
N  3.626783 -0.410103 1.037161
N  -4.761748 -0.512794 2.829502
N  -3.884338 -1.982772 1.293475
N  -4.247326 -1.641063 3.402015
N  -3.705203 -2.554237 2.507625
C  2.712647 -0.899811 0.20826
C  2.002417 -2.172963 0.619931
C  1.373593 -0.874405 -1.957059
C  2.713764 -3.456744 0.102313
C  3.08329 0.868555 -1.509342
C  -0.05599 -0.505241 -1.578088
C  4.109853 1.396668 -0.5955
C  1.994903 -4.743449 0.56768
C  4.339638 0.735792 0.653883
C  -0.42907 0.848962 -1.3851
C  -1.050985 -1.504505 -1.455779
C  -2.762004 0.17974 -0.934736
C  4.846184 2.550165 -0.956212
C  5.326104 1.262365 1.533042
C  2.695125 -6.027466 0.074002
C  -1.76122 1.182846 -1.073392
C  -2.385614 -1.172491 -1.138232
C  -4.174358 0.607412 -0.668501
C  5.816461 3.048296 -0.071983
C  6.058015 2.403674 1.177715
C  -4.970056 0.193093 0.448142
C  -4.734878 1.562648 -1.562394
C  -6.268932 0.745931 0.630594
C  -6.028203 2.092126 -1.382114
C  -4.516151 -0.744917 1.494374
C  -6.802642 1.683305 -0.273137
H  0.945453 -2.16821 0.301297
H  2.015554 -2.188824 1.723036
H  1.494707 -1.968373 -2.006173
H  1.613421 -0.4511 -2.949444
H  2.773144 -3.451318 -1.005794
H  3.757585 -3.45536 0.471918
H  0.945284 -4.728861 0.208983
H  1.943382 -4.749248 1.675072
H  0.3213 1.639112 -1.495816
H  -0.786849 -2.557886 -1.615037
H  4.654614 3.040886 -1.914171
H  5.493571 0.751307 2.485401
H  3.734973 -6.080962 0.447399
H  2.733904 -6.060707 -1.031216
H  2.164762 -6.933293 0.420223
H  -2.033627 2.233568 -0.920467
H  -3.133194 -1.962465 -1.043558
H  6.818114 2.802498 1.862455
H  -4.135239 1.87848 -2.422921
H  -6.852993 0.429237 1.500968
H  -6.427081 2.816159 -2.100839
H  -7.807685 2.088008 -0.114689
H  7.181507 4.464456 0.215413
H  -4.253317 -1.79999 4.409185
