program: Gaussian 09
title: 000024045
version: EM64L-G09RevD.01
frameworkgroup: C1[X(C10H12ClNO)]
method: RPBEPBE
basis: SDD
operation: Freq
keyword: #p
keyword: freq=noraman
keyword: PBEPBE/SDD
title: #p freq=noraman PBEPBE/SDD
converged: YES YES NO NO
title: Mulliken charges:
elementType: Cl O N C C C C C C C C C C H H H H H H H H H H H H
charge: -0.050279 -0.283605 -0.396321 -0.018974 -0.709100 -0.669051 0.171094 0.279545 -0.342634 -0.344178 -0.212558 -0.222003 -0.094224 0.247165 0.297710 0.226580 0.200534 0.233137 0.257055 0.211754 0.197036 0.281553 0.222649 0.259900 0.257215
chargesum: 0.00000
title: Mulliken charges with hydrogens summed into heavy atoms:
elementType: Cl O N C C C C C C C C C C
charge: -0.050279 -0.283605 -0.098611 0.228191 -0.048849 -0.003205 0.171094 0.279545 -0.061081 -0.121529 0.047342 0.035212 -0.094224
polarizability: 1.99120644e+02 1.24679258e+00 1.21882199e+02 -3.64902444e+00 -1.46819473e+00 6.86116195e+01
1716.lowfreq: -8.6208 -6.9310 -0.0034 -0.0030 -0.0023 6.1512 29.8632 43.3819 61.0465
frequency: 29.8139 43.2949 61.0422 82.2263 121.7875 197.9359 211.1943 229.4359 247.0806 268.8638 296.0232 336.4296 398.9191 408.4110 437.0742 457.3604 487.4493 516.8371 529.7261 622.7396 676.8116 698.7046 741.5414 816.8072 824.0946 850.1759 858.0340 921.4002 938.3906 948.5490 955.0496 985.4941 999.5976 1072.2469 1104.1923 1114.6688 1140.2535 1158.6958 1182.4473 1185.9336 1259.4084 1294.1125 1314.1267 1354.5537 1368.7987 1377.4514 1391.4759 1396.0257 1456.8237 1464.1899 1468.1717 1477.7894 1486.5650 1494.8970 1564.2373 1595.7558 1600.8177 2973.7593 2980.7865 3027.6331 3067.6774 3080.0630 3092.0852 3098.3283 3129.5986 3156.5371 3170.3666 3176.0171 3547.4930
redmass: 2.9792 4.8554 4.1423 5.6359 5.0957 3.7922 1.0286 4.8695 1.3279 4.3392 6.2136 3.0416 3.0656 2.8974 3.2900 3.1287 5.0058 3.6626 1.2537 6.9300 4.6651 7.2084 3.4607 3.8275 1.4975 1.6087 2.4064 1.2547 1.5674 1.4837 1.6987 1.3732 4.0385 2.8938 1.6162 1.9368 2.1552 2.1300 1.8013 1.3281 1.8728 1.2637 1.6698 1.2859 5.0264 1.2188 3.8902 1.2513 1.5204 1.1874 1.0522 1.2834 1.0532 1.8108 7.9217 6.2788 7.7301 1.0383 1.0364 1.0849 1.0977 1.0986 1.0998 1.1001 1.0894 1.0887 1.0954 1.0974 1.0770
irintensity: 0.0292 1.5217 4.0820 3.7564 1.0371 7.8475 0.1558 2.2620 0.6128 4.7190 2.3563 1.0184 8.4620 0.3089 0.8127 3.9952 15.0768 14.7395 101.8953 0.8109 14.7325 8.0193 26.2212 19.6618 13.6196 26.4260 14.0252 2.4623 5.5450 3.4963 5.2913 3.4376 37.4135 46.2636 8.5643 11.1066 17.4207 3.6255 40.5679 32.8857 88.3944 1.5976 32.3807 12.2131 1.6959 24.8062 3.6142 34.1416 224.3442 50.8751 2.9225 17.8190 18.4482 119.2001 60.4083 87.9228 68.6397 23.6139 31.5337 0.5891 12.1437 66.4448 31.2786 27.7615 12.7570 0.1118 4.3646 2.2487 12.2777
temp: 298.150 k
press: 1.00000 atm
elementType: 17 8 7 6 6 6 6 6 6 6 6 6 6 1 1 1 1 1 1 1 1 1 1 1 1
symmnumber: 1
zpe: 520508.8 jmol-1
zpe.correction: 0.198251 hartree
zpe.thermalcorrener: 0.211542 hartree
zpe.thermalcorrenthalpy: 0.212486 hartree
zpe.thermalcorrgfe: 0.156860 hartree
zpe.sumelectzpe: -977.355759 hartree
zpe.sumelectthermal: -977.342469 hartree
zpe.sumelectthermalent: -977.341525 hartree
zpe.sumelectthermalfe: -977.397150 hartree
dipole: 1.9150 -3.2361 1.1780
dipole: 3.9405
quadrupole: -83.3294 -81.7819 -87.7498
quadrupole: -9.0836 2.2864 2.3138
quadrupole: 0.9577 2.5051 -3.4628 -9.0836 2.2864 2.3138
hfenergy: -977.5540107 hartree
pointgroup: C01 [X(C10H12Cl1N1O1)]
dipole: 0.7721618 1.2890073 -0.3816719 debye
dipolederiv: -0.9257795 0.1271159 -0.0496066 0.1484777 -0.1455853 0.0025636 -0.0583628 0.004168 -0.0714524 -0.8197228 0.181695 -0.0333209 -0.0548514 -0.882224 0.1771786 0.0608839 0.1398509 -0.4031343 -1.2188459 -0.3215562 0.1652678 -0.5248804 -0.6508395 -0.0290505 0.1313962 -0.1065368 -0.4471208 0.8318279 0.0818396 -0.07988 -0.0687735 0.1938466 0.0858019 0.0346736 0.1348848 0.298593 -0.0992417 -0.0559968 0.0127578 -0.0347031 -0.0143087 -0.078656 -0.0034305 -0.0889801 0.0594084 -0.1066708 -0.0582236 0.0378817 -0.0024567 -0.0097351 -0.1014913 0.0170902 -0.1312004 -0.0543109 1.7262516 0.0789907 -0.0597615 0.4274071 1.134582 -0.3181919 -0.1603091 -0.2291536 0.2723153 -0.4352916 0.0371288 -0.0238293 0.103845 -0.0986067 0.0216798 -0.0512809 0.0245235 -0.0106723 0.0653729 -0.0809239 0.0104675 0.1025339 0.0491447 0.0232507 -0.0043924 -0.0108166 -0.1042459 0.0758713 0.0291679 0.0389553 -0.1115586 0.0413432 0.0243267 0.0828128 0.0268216 -0.1296333 -0.3166363 0.1772783 0.0034553 0.1913466 -0.0475902 0.0183299 0.000142 0.0194898 -0.1069765 -0.4590119 -0.0167452 -0.0289472 -0.0861423 0.0157302 0.0097595 -0.0348084 0.013901 -0.104803 1.3239042 -0.2029507 0.0919358 -0.1796576 0.1883387 0.0098537 0.104558 0.0054957 -0.0522761 0.0219209 -0.0257002 0.0187106 0.0595743 0.0037692 0.0742112 -0.0181283 0.0400314 -0.0403392 0.1821633 0.0241265 -0.0035087 0.0942775 0.1245807 0.0730439 -0.0431027 0.0970255 0.2636742 -0.1897318 -0.0062304 -0.0249091 0.0277588 0.0717808 0.0103408 -0.0081129 0.0048155 0.1084571 0.0887265 0.0495361 -0.058371 -0.0065149 -0.0415529 0.0842053 -0.0337753 0.1455241 -0.0588641 0.0967687 0.0458142 0.0902307 0.0178289 0.0263089 -0.0862913 0.0662127 -0.0942934 -0.0977677 0.0923644 -0.0973266 -0.0387582 -0.0829523 -0.0557792 -0.0677092 -0.0472409 -0.0349997 0.065358 -0.2228479 0.0458101 0.0059208 0.0634851 0.1066176 -0.0045346 0.0057811 0.0186419 0.0653644 0.093836 0.0511306 -0.0285003 0.0147433 -0.0331568 0.1480973 0.0062333 0.0784347 -0.0659571 0.1247586 0.0598989 0.0011499 0.0202372 0.0212522 -0.0165626 0.0174789 -0.0008298 0.1542498 -0.0099284 -0.1057637 -0.0272547 -0.1086607 -0.0034813 -0.0248546 -0.0388839 -0.0194783 0.135652 0.0181223 -0.0704872 -0.0169612 -0.0674785 0.0282209 -0.0182936 -0.0193518 -0.019022 0.1614088 0.0618201 0.0523721 -0.0031244 0.0571146 -0.0226559 -0.0170072 -0.0060828 -0.0182976 0.1630724 unknown
polarizability: 199.0856096|-2.7032641|121.9087689|2.9597122|2.0282663|68.6200845 unknown
InChI: InChI=1S/C10H12ClNO/c1-7(2)12-10(13)8-3-5-9(11)6-4-8/h3-7,12H,1-2H3
charge 0 multiplicity 1
25 atoms
Cl -5.001045 0.582936 -0.204389
O  1.395143 -1.776516 0.496937
N  1.920888 0.423716 -0.035856
C  3.385425 0.208093 0.045357
C  4.07826 1.534385 0.414868
C  3.931464 -0.395486 -1.270633
C  1.016133 -0.595723 0.204533
C  -0.448336 -0.242742 0.101521
C  -1.364551 -1.312801 -0.061962
C  -0.947894 1.082634 0.192996
C  -2.750227 -1.072959 -0.159464
C  -2.333161 1.34095 0.101648
C  -3.212585 0.256075 -0.081063
H  3.536026 -0.533189 0.851416
H  1.593066 1.319299 -0.401625
H  5.166634 1.3788 0.515041
H  3.924405 2.299763 -0.371427
H  3.696859 1.932375 1.372094
H  3.408917 -1.339482 -1.499677
H  5.011486 -0.611155 -1.175855
H  3.791625 0.304141 -2.116128
H  -0.965793 -2.331415 -0.10066
H  -0.27547 1.928929 0.375301
H  -3.455515 -1.898415 -0.290919
H  -2.720653 2.360486 0.181447
