program: Gaussian 09
title: 000285926
version: EM64L-G09RevD.01
frameworkgroup: C1[X(C18H28O2)]
method: RPBEPBE
basis: SDD
operation: Freq
keyword: #pfreq=noraman
keyword: PBEPBE/SDD
title: #p freq=noraman PBEPBE/SDD
converged: YES YES NO NO
title: Mulliken charges:
elementType: O O C C C C C C C C C C C C C C C C C C H H H H H H H H H H H H H H H H H H H H H H H H H H H H
charge: -0.270877 -0.270063 -0.375798 -0.368082 -0.546206 -0.367189 0.285666 -0.369602 0.086683 -0.835333 0.440181 -0.692985 -0.830216 -0.566493 -0.610982 0.360397 0.360335 -0.515784 -0.536924 -0.537382 0.198393 0.205221 0.187016 0.203497 0.214070 0.195942 0.188201 0.196942 0.193586 0.200728 0.256877 0.222922 0.218950 0.219079 0.207842 0.213872 0.226120 0.238441 0.232192 0.256806 0.245355 0.273359 0.244026 0.218553 0.219952 0.218743 0.220112 0.243858
chargesum: 0.00000
title: Mulliken charges with hydrogens summed into heavy atoms:
elementType: O O C C C C C C C C C C C C C C C C C C
charge: -0.270877 -0.270063 0.027815 0.022431 -0.136194 0.017955 0.285666 0.024712 0.086683 -0.136585 0.440181 -0.052193 -0.133463 -0.309687 -0.365627 0.360397 0.360335 -0.242424 0.145606 0.145332
polarizability: 2.68439352e+02 -6.16519112e+00 2.23221584e+02 4.54386655e+00 3.91301418e+00 1.46173200e+02
1716.lowfreq: -6.2742 -2.0524 -0.0009 -0.0006 -0.0004 3.8271 14.6536 20.2501 28.2232
frequency: 13.2653 20.0421 28.2046 36.1362 69.6012 74.7255 87.9940 96.3947 101.0195 106.8149 117.4313 139.0491 147.4568 162.5575 176.4540 185.1751 191.9114 211.7485 243.3433 252.3001 260.8618 277.7205 291.1990 301.5138 315.8908 335.2455 354.6590 390.2731 424.8188 450.8997 472.8715 478.4927 540.3794 559.7716 571.1063 605.4917 625.2539 630.6215 699.6065 722.3713 749.7930 767.2554 789.3681 840.5808 849.0977 861.9289 864.5202 868.9361 877.8369 915.1509 960.0219 974.9756 979.8440 986.6890 996.1960 1004.4370 1029.2150 1039.7971 1044.9590 1050.0719 1059.5177 1095.2785 1096.5660 1111.8627 1113.1023 1113.5831 1130.4347 1144.6766 1159.7389 1161.5553 1178.6758 1184.8986 1225.7903 1239.1453 1252.2508 1267.4213 1274.8641 1286.3444 1290.4353 1304.5889 1323.3468 1334.6358 1339.3623 1354.6631 1385.8434 1387.8111 1393.0307 1394.4957 1413.6971 1442.0297 1445.7970 1456.5575 1458.7865 1459.5996 1462.5360 1464.3885 1465.5603 1466.7850 1468.2513 1470.2480 1472.2643 1472.5189 1478.2310 1479.9545 1481.5946 1487.9415 1501.4261 1589.2850 1608.5435 1665.8316 2950.2896 2955.4125 2955.6194 2955.7015 2956.0562 2964.2911 2966.6263 2970.3610 2974.0412 2975.1171 2992.9996 3007.4921 3017.5211 3021.0465 3028.1339 3037.5663 3042.0841 3042.2639 3045.7759 3068.5382 3075.3588 3099.0959 3099.8013 3120.5338 3120.7068 3161.3070 3167.3438 3185.0938
redmass: 2.5748 4.0974 3.7188 2.9432 2.9550 2.8257 3.1844 3.0502 1.6222 3.3977 1.3121 2.2567 1.9167 2.7069 1.3499 1.8305 1.6736 1.5374 1.4905 2.2309 2.0585 2.1028 3.0654 2.8793 2.5728 3.3435 4.3574 2.3224 2.8459 2.9948 5.9863 3.1989 4.3354 4.0016 3.6304 4.7920 3.3472 3.7231 1.9349 1.1043 1.1940 2.6173 1.4558 1.5068 1.4329 2.2290 1.8195 6.4022 1.5452 2.4358 1.7693 5.8689 1.7749 1.4800 2.8118 3.1235 1.9955 1.8978 1.5882 1.7225 2.2325 1.9768 2.3213 1.2591 1.2599 2.0536 1.9857 2.1768 1.6029 1.3950 1.6534 2.1649 1.3366 1.8862 1.6211 1.2698 1.3595 1.1183 1.1307 1.3678 4.5720 1.4466 1.4876 1.5066 8.9793 1.2183 1.2249 1.2252 1.9311 1.2140 1.4942 1.0952 1.1220 1.5319 1.1402 1.0530 1.0517 1.0636 1.0685 1.0654 1.0619 1.0548 1.0585 1.1114 1.3806 1.0590 1.0881 6.5207 6.7006 6.9962 1.0598 1.0375 1.0353 1.0583 1.0353 1.0592 1.0619 1.0396 1.0604 1.0385 1.0950 1.0985 1.1002 1.0960 1.1017 1.0967 1.1038 1.1038 1.1036 1.0994 1.0997 1.0956 1.0958 1.0992 1.0991 1.0898 1.0910 1.0926
irintensity: 0.0411 0.0816 0.0191 0.0460 7.3394 3.8605 0.4975 0.1392 0.0777 0.0157 0.3125 0.0356 0.2100 0.8329 0.5034 0.7254 1.2054 1.4389 0.3606 3.3762 1.9660 1.5045 3.4304 2.9692 1.3593 2.0899 0.0421 1.2517 0.9325 0.1092 0.0960 1.0354 4.8021 9.1112 9.7767 0.2874 2.3649 1.6662 19.8876 8.8561 4.2004 5.5152 8.3683 6.9693 5.3837 0.6926 63.9343 2.8186 11.2375 18.7978 0.5646 1.4959 2.5791 9.3713 0.5950 5.3506 34.2663 36.7540 6.3519 32.9938 0.5558 5.5297 0.7835 0.2683 0.2405 1.2601 188.6649 31.6651 111.0608 12.9908 1.7654 0.6546 3.3795 23.5205 8.9443 7.5080 5.3877 2.8180 0.5860 6.3876 51.9885 0.5741 0.9316 1.6860 8.7241 16.8634 20.1011 0.9620 102.2270 3.7848 35.0274 2.0644 1.0632 19.5350 6.5667 4.3052 19.4631 9.5711 4.3206 10.8520 16.9810 54.0608 3.1869 12.7024 1.3478 15.5374 9.2674 136.7116 262.5926 6.4868 0.7036 21.2967 89.2322 41.9760 29.5440 22.8275 30.9723 35.2171 75.8339 47.2523 3.1984 8.8416 30.4516 26.2066 18.4565 19.6380 31.0628 61.4297 131.7777 64.3128 71.4957 24.1612 42.4117 26.7024 33.7300 10.1351 2.1130 0.1398
temp: 298.150 k
press: 1.00000 atm
elementType: 8 8 6 6 6 6 6 6 6 6 6 6 6 6 6 6 6 6 6 6 1 1 1 1 1 1 1 1 1 1 1 1 1 1 1 1 1 1 1 1 1 1 1 1 1 1 1 1
symmnumber: 1
zpe: 1091552.2 jmol-1
zpe.correction: 0.415750 hartree
zpe.thermalcorrener: 0.439676 hartree
zpe.thermalcorrenthalpy: 0.440620 hartree
zpe.thermalcorrgfe: 0.359543 hartree
zpe.sumelectzpe: -851.557536 hartree
zpe.sumelectthermal: -851.533611 hartree
zpe.sumelectthermalent: -851.532666 hartree
zpe.sumelectthermalfe: -851.613743 hartree
dipole: 2.8481 -0.1593 0.5881
dipole: 2.9125
quadrupole: -139.0699 -104.2320 -125.2126
quadrupole: 3.0836 -1.8397 -0.0450
quadrupole: -16.2317 18.6062 -2.3744 3.0836 -1.8397 -0.0450
hfenergy: -851.9732863 hartree
pointgroup: C01 [X(C18H28O2)]
dipole: -1.1160521 0.1613212 0.2035787 debye
polarizability: 267.8474756|-8.9781489|217.1767419|-3.2028842|-21.9259191|152.8099186 unknown
InChI: InChI=1S/C18H28O2/c1-6-7-8-9-10-14(2)15(3)16-11-17(19-4)13-18(12-16)20-5/h11-13H,6-10H2,1-5H3
charge 0 multiplicity 1
48 atoms
O  3.971694 -2.83037 0.16729
O  4.615963 1.790298 -0.707029
C  -3.268146 0.025142 -0.119691
C  -4.747389 0.385554 0.144279
C  -2.288839 1.186427 0.213045
C  -5.716498 -0.772377 -0.189867
C  -0.839465 0.872674 -0.157805
C  -7.20274 -0.475496 0.130648
C  0.036911 0.257933 0.703176
C  -0.490606 1.236636 -1.594283
C  1.473982 -0.009991 0.346127
C  -7.813272 0.663294 -0.717903
C  -0.348183 -0.194264 2.108086
C  2.328343 1.058779 -0.029822
C  1.997354 -1.326644 0.433044
C  3.360813 -1.563612 0.125884
C  3.690878 0.801232 -0.326517
C  4.214731 -0.506112 -0.252717
C  3.142058 -3.969741 0.559653
C  4.132869 3.168512 -0.7990
H  -3.144137 -0.264956 -1.183294
H  -2.988683 -0.865975 0.47813
H  -4.872392 0.669757 1.21087
H  -5.011849 1.283085 -0.450494
H  -2.388647 1.4435 1.284558
H  -2.613999 2.084585 -0.351505
H  -5.620936 -1.028345 -1.266236
H  -5.399421 -1.674343 0.37375
H  -7.300183 -0.225964 1.207275
H  -7.794117 -1.399399 -0.029463
H  0.466624 0.805056 -1.926059
H  -1.287128 0.879277 -2.277011
H  -0.437132 2.336371 -1.727287
H  -7.314705 1.630136 -0.522917
H  -7.714093 0.444903 -1.798404
H  -8.888867 0.792639 -0.496853
H  -0.152126 -1.27562 2.241364
H  0.26276 0.327922 2.870086
H  -1.411242 -0.02072 2.337837
H  1.919337 2.071837 -0.066254
H  1.333447 -2.149611 0.711785
H  5.265678 -0.696999 -0.481781
H  3.815219 -4.839332 0.52864
H  2.741887 -3.845355 1.58517
H  2.303386 -4.123029 -0.147657
H  3.330585 3.266583 -1.556643
H  3.762856 3.534757 0.178693
H  5.00792 3.759267 -1.108199
