program: Gaussian 09
title: 000286051
version: EM64L-G09RevD.01
frameworkgroup: C1[X(C23H27ClN4O)]
method: RPBEPBE
basis: SDD
operation: Freq
keyword: #p
keyword: freq=noraman
keyword: PBEPBE/SDD
title: #p freq=noraman PBEPBE/SDD
converged: NO YES NO NO
title: Mulliken charges:
elementType: Cl O N N N N C C C C C C C C C C C C C C C C C C C C C C C H H H H H H H H H H H H H H H H H H H H H H H H H H H
charge: -0.079989 -0.227747 -0.152794 0.044586 -0.405327 -0.004003 0.502131 -0.496678 -0.499720 -0.487703 -0.488387 -0.412595 -0.416669 -0.444335 -0.461899 -0.387379 0.517846 -0.369555 -0.391952 -0.329580 -0.388615 0.551570 -0.389301 0.177054 0.277095 -0.286117 -0.314593 -0.323330 -0.328211 0.205886 0.196621 0.199925 0.202575 0.212669 0.218106 0.221527 0.205383 0.206043 0.199380 0.200741 0.198061 0.223195 0.217495 0.218183 0.237166 0.188393 0.207789 0.245191 0.221954 0.285772 0.227147 0.289983 0.271717 0.226805 0.245747 0.242748
chargesum: 0.00000
title: Mulliken charges with hydrogens summed into heavy atoms:
elementType: Cl O N N N N C C C C C C C C C C C C C C C C C C C C C C C
charge: -0.079989 -0.227747 -0.152794 0.044586 -0.115345 -0.004003 0.502131 -0.094171 -0.097220 -0.056929 -0.061477 -0.007172 -0.017868 -0.003646 -0.006550 0.008803 0.517846 -0.124364 -0.169998 -0.329580 -0.102844 0.551570 -0.162154 0.177054 0.277095 -0.014400 -0.087788 -0.077583 -0.085463
polarizability: 6.65141670e+02 1.74591805e+01 2.72195145e+02 -1.93024315e+01 2.17960348e+01 1.75455651e+02
1716.lowfreq: -4.3968 0.0017 0.0018 0.0023 1.7140 7.4295 12.8988 19.5030 24.4065
frequency: 10.5440 19.1741 24.0210 27.6031 34.6165 52.1883 68.6098 87.4561 96.4160 104.2001 139.7664 154.4645 164.5013 170.7370 188.5501 200.4936 217.4527 222.1964 261.1658 264.1107 272.8701 320.5113 331.5531 343.8411 363.4667 366.4432 370.9566 384.0731 398.0771 410.4936 425.9317 431.3941 442.8663 456.4821 462.7526 470.6779 498.1357 512.9263 540.4427 576.0315 585.3381 608.2887 626.0848 659.6551 662.6387 671.0977 673.5400 687.6618 715.9652 742.0717 752.1322 778.8787 794.0820 813.7838 817.7724 829.3255 831.8610 838.5276 842.5783 880.5362 889.5870 902.9753 904.0759 922.8092 930.6353 936.5983 939.3248 957.2664 965.4770 983.4567 984.5251 985.8421 1002.2478 1005.1041 1010.8129 1022.3083 1026.2951 1040.5949 1058.7060 1060.7164 1084.8874 1090.0295 1100.7305 1109.3846 1129.5308 1134.1665 1140.7828 1155.8462 1178.1908 1187.9269 1196.0486 1217.3485 1239.3791 1242.8442 1247.8596 1249.1381 1251.9920 1266.1603 1276.1659 1293.9531 1298.9267 1307.0071 1319.0652 1322.8287 1326.8822 1331.4813 1334.8281 1337.3072 1339.5019 1343.8959 1352.9541 1356.5000 1359.1420 1365.7071 1398.9083 1408.5042 1446.5793 1448.8801 1453.9239 1460.0977 1460.7358 1463.3023 1470.4933 1472.3999 1478.5133 1483.2770 1490.4803 1503.3610 1518.1379 1525.6879 1544.2322 1569.8956 1581.7150 1607.7416 1629.4157 2950.8594 2953.3339 2954.7762 2961.0712 2965.7759 2969.7049 2972.1011 2977.2258 2985.1122 3000.2988 3013.0279 3017.8547 3027.7214 3030.9417 3031.8975 3042.1720 3048.5814 3098.3540 3101.0912 3123.5365 3139.5267 3147.8997 3149.9118 3173.2098 3173.5475 3182.9265 3377.8942
redmass: 5.0200 7.6240 4.6960 5.4935 4.5485 5.2529 4.5982 5.8635 4.6114 4.3832 3.7309 10.0728 5.2649 4.2565 4.0331 3.2987 4.2406 3.5120 3.2969 2.5220 3.5132 2.9604 2.1079 7.0922 3.8457 2.5614 3.7527 3.0669 2.1758 4.8350 2.1247 2.6720 4.7947 3.3143 3.7534 2.9122 3.6104 4.4666 2.0616 3.1703 3.2865 3.0711 1.2685 6.2964 5.8259 7.3305 3.1074 4.5105 2.9994 5.2977 2.9472 1.4689 1.6085 1.9271 1.6185 1.8256 2.7048 2.0814 1.9218 2.3692 1.2605 4.8082 2.7904 1.4484 1.9264 2.7532 1.5039 3.4490 1.7912 1.9518 1.5442 1.4470 2.0858 1.6645 2.6727 2.0294 6.9870 2.2439 1.8798 2.1224 1.6233 1.3899 1.7534 2.0633 3.4644 1.8254 2.3962 1.5215 1.6128 1.6599 1.4485 1.3348 1.4453 2.0070 1.5742 1.5811 1.4717 1.2797 1.3733 1.4637 5.9443 1.4989 1.4811 1.6372 1.4612 1.6123 1.3902 1.4650 1.3698 1.5297 2.3345 1.6549 1.4249 1.3543 1.8695 2.5917 4.1625 1.1305 1.0879 1.1279 1.8238 1.0901 1.0846 1.0882 1.0941 1.0925 1.0998 2.0464 5.1289 3.7692 7.4946 5.3604 5.6535 8.0675 7.1525 1.0612 1.0707 1.0705 1.0644 1.0629 1.0595 1.0634 1.0634 1.0620 1.0873 1.0972 1.0974 1.0961 1.1013 1.1008 1.1028 1.1000 1.0892 1.0908 1.0876 1.0896 1.0973 1.0881 1.0944 1.0964 1.0906 1.0752
irintensity: 0.0414 0.3859 0.6490 0.5422 0.7494 1.2973 1.2837 4.1242 4.1434 2.2180 3.3447 0.5050 4.3779 1.9457 10.2071 4.6108 12.6349 4.4007 3.0981 1.4195 4.9834 0.2489 2.8367 5.4143 2.0696 0.1532 2.9237 4.5637 0.8572 5.3819 1.5984 0.6243 5.3086 5.0845 2.9347 0.5490 3.5033 7.5265 0.3426 5.0224 4.2312 4.1355 82.7689 1.9011 7.6560 53.1537 0.4151 24.1336 0.6629 24.6907 8.8023 0.6893 0.9576 4.9146 8.2790 35.5836 20.4997 27.1389 10.0950 9.6853 3.3254 23.6347 20.8311 5.4996 3.3374 97.1157 27.2034 2.4325 0.9455 21.3625 4.8747 2.4190 20.1541 3.9147 37.3840 7.9822 22.1069 13.9500 1.8490 25.4298 19.2860 7.3364 11.3496 6.6580 84.1421 15.3384 21.2174 30.1597 32.7885 41.7836 6.0619 22.9801 129.3396 158.5442 39.4205 90.5891 60.1914 9.6594 13.3039 60.4210 0.6676 13.7741 4.9873 8.5187 7.2708 40.6121 7.9061 2.7200 13.1127 2.0899 77.5953 1.1876 1.3084 15.8528 17.5779 73.2385 39.3321 5.8779 4.6176 13.8116 21.2489 15.8990 22.7899 20.8191 19.6138 9.2508 58.5007 514.9683 89.6859 64.3628 69.8360 225.4651 14.9550 342.5083 785.6177 18.9176 91.3389 44.4460 66.3223 39.3869 44.2404 18.8429 17.0715 23.3955 44.5821 56.0445 49.0102 82.5017 66.2596 36.3545 128.7867 72.4321 21.2541 9.3676 12.6282 32.9529 16.5859 2.5888 16.0508 7.0478 9.9223 24.0658
temp: 298.150 k
press: 1.00000 atm
elementType: 17 8 7 7 7 7 6 6 6 6 6 6 6 6 6 6 6 6 6 6 6 6 6 6 6 6 6 6 6 1 1 1 1 1 1 1 1 1 1 1 1 1 1 1 1 1 1 1 1 1 1 1 1 1 1 1
symmnumber: 1
zpe: 1206460.2 jmol-1
zpe.correction: 0.459516 hartree
zpe.thermalcorrener: 0.485758 hartree
zpe.thermalcorrenthalpy: 0.486702 hartree
zpe.thermalcorrgfe: 0.399725 hartree
zpe.sumelectzpe: -1644.786587 hartree
zpe.sumelectthermal: -1644.760345 hartree
zpe.sumelectthermalent: -1644.759401 hartree
zpe.sumelectthermalfe: -1644.846378 hartree
dipole: 8.7849 2.1309 -0.1344
dipole: 9.0406
quadrupole: -184.5453 -181.9887 -180.3277
quadrupole: -15.0682 -0.8859 3.1421
quadrupole: -2.2581 0.2985 1.9596 -15.0682 -0.8859 3.1421
hfenergy: -1645.2461032 hartree
pointgroup: C01 [X(C23H27Cl1N4O1)]
dipole: -3.4679605 -0.6324811 -0.4737369 debye
polarizability: 663.6113711|-5.2321422|272.6010755|38.0498493|19.6346254|176.5800191 unknown
InChI: InChI=1S/C23H27ClN4O/c24-21-16-20(28-14-10-23(11-15-28)8-2-1-3-9-23)5-4-19(21)17-26-27-22(29)18-6-12-25-13-7-18/h4-7,12-13,16-17,27H,1-3,8-11,14-15H2
charge 0 multiplicity 1
56 atoms
Cl 0.569914 -3.166345 -1.478265
O  5.173436 2.002954 0.738936
N  -3.303213 0.289766 -0.928564
N  3.152781 0.170346 0.027363
N  4.498969 -0.155277 0.086473
N  9.597342 -0.563594 0.657699
C  -6.138778 -0.017196 0.007029
C  -7.038287 -0.686496 1.091003
C  -7.061808 0.749352 -0.993574
C  -5.098136 0.930322 0.680561
C  -5.347127 -1.137381 -0.734249
C  -7.999584 0.299579 1.796386
C  -8.039355 1.736561 -0.308874
C  -3.994758 1.428415 -0.288134
C  -4.24403 -0.581018 -1.663158
C  -8.895442 1.032141 0.770394
C  -1.942356 0.02369 -0.786248
C  -1.390342 -1.253007 -1.134164
C  -1.020657 1.015345 -0.298427
C  -0.016972 -1.485549 -1.009793
C  0.343625 0.743788 -0.183885
C  0.910989 -0.520267 -0.539745
C  2.342099 -0.767428 -0.432883
C  5.448008 0.797315 0.480264
C  6.863477 0.269806 0.53753
C  7.920802 1.200551 0.377389
C  7.205869 -1.084964 0.783337
C  9.25396 0.743625 0.438137
C  8.571541 -1.448128 0.833359
H  -6.395533 -1.192802 1.83924
H  -7.643047 -1.479956 0.601585
H  -7.656662 -0.003816 -1.551888
H  -6.461362 1.292325 -1.74986
H  -5.596353 1.812669 1.123324
H  -4.610692 0.38496 1.513308
H  -4.877655 -1.806496 0.015169
H  -6.04735 -1.753645 -1.333254
H  -7.420084 1.043835 2.378433
H  -8.625262 -0.250507 2.525509
H  -8.693593 2.195386 -1.075452
H  -7.475344 2.569811 0.157498
H  -4.441882 2.072565 -1.07487
H  -3.278728 2.048153 0.27057
H  -3.703997 -1.399449 -2.160981
H  -4.709833 0.020681 -2.472329
H  -9.563466 0.293486 0.280391
H  -9.547806 1.765702 1.282007
H  -2.025859 -2.073674 -1.471229
H  -1.369931 2.018086 -0.039921
H  1.034685 1.514406 0.173325
H  2.704116 -1.762045 -0.756732
H  4.824152 -1.082259 -0.228729
H  7.684131 2.256735 0.218731
H  6.445122 -1.849271 0.979955
H  10.09088 1.43863 0.309007
H  8.866081 -2.485311 1.029601
