program: Gaussian 09
title: 000285903
version: EM64L-G09RevD.01
frameworkgroup: C1[X(C10H18O2)]
method: RPBEPBE
basis: SDD
operation: Freq
keyword: #pfreq=noraman
keyword: PBEPBE/SDD
title: #p freq=noraman PBEPBE/SDD
converged: YES YES NO NO
title: Mulliken charges:
elementType: O O C C C C C C C C C C H H H H H H H H H H H H H H H H H H
charge: -0.473062 -0.473062 0.280808 0.280807 -0.505413 -0.478117 -0.478119 -0.505411 -0.402825 -0.435808 -0.435811 -0.402827 0.222001 0.205327 0.221813 0.212140 0.212140 0.221814 0.205324 0.222003 0.231446 0.201033 0.219813 0.176399 0.176398 0.219813 0.201034 0.231445 0.324449 0.324449
chargesum: 0.00000
title: Mulliken charges with hydrogens summed into heavy atoms:
elementType: O O C C C C C C C C C C
charge: -0.148613 -0.148613 0.280808 0.280807 -0.078085 -0.044164 -0.044166 -0.078084 0.029654 -0.039596 -0.039600 0.029652
polarizability: 1.22518096e+02 -2.79068398e-02 1.02410541e+02 1.11607637e+00 2.29615110e+00 9.64489422e+01
1716.lowfreq: -18.3777 -0.0010 -0.0005 0.0002 5.7105 12.5625 123.8776 148.3609 192.5438
frequency: 123.8776 148.3609 192.5216 209.9348 234.3194 263.7753 271.3713 303.5777 316.6915 320.3783 347.8763 366.8316 401.2595 448.0883 468.8263 470.0341 515.8158 536.0463 587.0035 638.9154 761.3844 775.8992 790.0374 835.4738 859.5947 861.8579 879.2473 894.3036 908.8476 963.6506 984.6983 986.1153 1008.2415 1036.6037 1061.1410 1083.1033 1094.3782 1109.2522 1125.9637 1126.6356 1150.4211 1160.0054 1184.1021 1223.9019 1231.7413 1256.3919 1264.1693 1266.5934 1283.8383 1300.5185 1327.7545 1330.4029 1333.5797 1334.6313 1339.8002 1351.9702 1356.6264 1372.0951 1438.5372 1439.9970 1457.5927 1459.0028 1461.5087 1462.7988 1476.6119 1478.2166 2926.4267 2926.4563 2978.0784 2978.2621 2989.5933 2990.4393 2992.0289 2992.0840 3027.0044 3027.5132 3041.3090 3042.3721 3052.4961 3055.7892 3058.2530 3062.4824 3559.5383 3560.4862
redmass: 2.7486 2.8141 2.1477 5.2033 1.6823 1.6836 1.1047 2.7589 2.2121 2.7150 1.9209 2.3948 3.4567 2.2894 2.4403 3.0557 1.8269 3.4970 1.9120 3.9350 2.8801 1.9727 1.5003 2.9126 2.3663 1.9670 1.5811 2.1732 2.1488 1.7569 2.0516 2.1500 2.0668 1.5186 1.4815 1.4473 1.8618 1.1949 2.7979 3.6151 1.2359 2.9577 1.5533 1.3817 1.3118 1.5353 1.3102 1.3053 1.2636 1.8327 1.3819 1.3878 1.4098 1.4476 1.5033 1.6888 1.4981 2.0506 1.0864 1.0908 1.0819 1.0888 1.0826 1.0902 1.0848 1.0873 1.0701 1.0700 1.0615 1.0616 1.0621 1.0612 1.0619 1.0629 1.0898 1.0897 1.0979 1.0982 1.1020 1.1010 1.1023 1.1013 1.0653 1.0655
irintensity: 2.3423 0.5552 0.0000 6.8397 0.0000 0.0003 235.5871 10.1342 5.4307 0.0000 2.8076 0.0000 0.0000 0.0000 6.5695 0.0000 2.0869 16.8892 0.0000 0.0000 6.7223 0.0000 2.0614 15.0614 0.0000 50.8600 0.0000 0.0000 0.0000 74.8627 0.0000 42.3616 12.7124 19.5370 0.0000 0.0000 28.5465 0.0000 0.0000 7.0796 5.1078 0.0000 21.0230 22.1652 0.0000 0.0000 52.9646 0.0000 3.3662 0.0000 2.1512 0.0000 4.0287 0.0000 2.7573 26.4911 0.0000 0.0000 8.8961 0.0000 0.0000 20.4702 31.3999 0.0000 29.6724 0.0000 0.8643 96.8785 0.0024 42.1374 33.9355 0.0001 120.2678 0.1085 130.1169 0.0023 0.0001 50.5835 16.6472 0.0000 0.0000 117.5936 2.5524 0.0000
temp: 298.150 k
press: 1.00000 atm
elementType: 8 8 6 6 6 6 6 6 6 6 6 6 1 1 1 1 1 1 1 1 1 1 1 1 1 1 1 1 1 1
symmnumber: 1
zpe: 695720.3 jmol-1
zpe.correction: 0.264986 hartree
zpe.thermalcorrener: 0.276638 hartree
zpe.thermalcorrenthalpy: 0.277582 hartree
zpe.thermalcorrgfe: 0.229440 hartree
zpe.sumelectzpe: -541.340230 hartree
zpe.sumelectthermal: -541.328578 hartree
zpe.sumelectthermalent: -541.327634 hartree
zpe.sumelectthermalfe: -541.375776 hartree
dipole: 0.0000 0.0001 0.0001
dipole: 0.0001
quadrupole: -70.3621 -77.0249 -74.2229
quadrupole: -3.4614 4.8424 3.2435
quadrupole: 3.5078 -3.1549 -0.3529 -3.4614 4.8424 3.2435
hfenergy: -541.6052159 hartree
pointgroup: C01 [X(C10H18O2)]
dipole: 0.0000042 -0.0000218 -0.0000291 debye
polarizability: 122.5015529|0.0310723|102.6157479|-1.3000837|1.9991139|96.2602788 unknown
InChI: InChI=1S/C10H18O2/c11-9-5-1-2-6-10(9,12)8-4-3-7-9/h11-12H,1-8H2
charge 0 multiplicity 1
30 atoms
O  -0.093471 1.209449 -1.456938
O  0.094054 -1.213198 1.459634
C  -0.00434 0.785846 -0.029252
C  0.004967 -0.789596 0.031945
C  -1.284354 1.354883 0.618739
C  1.282867 1.354904 0.611803
C  -1.282232 -1.358642 -0.609131
C  1.284991 -1.358646 -0.616023
C  -2.566512 0.767783 -0.016898
C  2.568284 0.775193 -0.030232
C  -2.567651 -0.778944 0.032913
C  2.567145 -0.771532 0.01961
H  -1.270788 2.454342 0.50102
H  -1.260407 1.14506 1.707407
H  1.277132 1.094773 1.686616
H  1.265368 2.459004 0.527263
H  -1.264733 -2.462744 -0.524611
H  -1.27649 -1.098489 -1.683939
H  1.261057 -1.148854 -1.704697
H  1.271425 -2.458102 -0.498278
H  -2.614442 1.095028 -1.072019
H  -3.460826 1.170295 0.49668
H  3.456205 1.176727 0.493747
H  2.667899 1.116648 -1.085494
H  -2.667267 -1.120417 1.088168
H  -3.455571 -1.18047 -0.491075
H  3.461461 -1.174055 -0.493954
H  2.615068 -1.098756 1.074738
H  0.806409 1.125485 -1.862009
H  -0.805847 -1.129276 1.864668
