program: Gaussian 09
title: 000285943
version: EM64L-G09RevD.01
frameworkgroup: C1[X(C21H14O2)]
method: RPBEPBE
basis: SDD
operation: Freq
keyword: #pfreq=noraman
keyword: PBEPBE/SDD
title: #p freq=noraman PBEPBE/SDD
converged: YES YES NO NO
title: Mulliken charges:
elementType: O O C C C C C C C C C C C C C C C C C C C C C H H H H H H H H H H H H H H
charge: -0.307237 -0.183221 0.188932 0.113956 0.172961 0.087562 0.292492 0.168490 0.071708 -0.298331 -0.398090 -0.372752 -0.362697 -0.356738 -0.368239 -0.255265 -0.229160 -0.235639 -0.227843 -0.253029 -0.227648 -0.244024 -0.244832 0.270813 0.267409 0.305548 0.257722 0.252055 0.259791 0.233361 0.237652 0.229830 0.232640 0.225704 0.233075 0.230702 0.232342
chargesum: 0.00000
title: Mulliken charges with hydrogens summed into heavy atoms:
elementType: O O C C C C C C C C C C C C C C C C C C C C C
charge: -0.307237 -0.183221 0.188932 0.113956 0.172961 0.087562 0.292492 0.168490 0.071708 -0.027518 -0.130681 -0.067204 -0.104975 -0.104683 -0.108447 -0.021904 0.008492 -0.005809 0.004796 -0.027324 0.005427 -0.013322 -0.012490
polarizability: 3.77145283e+02 -4.89872908e+00 2.80146352e+02 -1.40304349e+00 6.03456254e-01 1.25830954e+02
1716.lowfreq: -9.8376 -2.3629 -0.0007 -0.0006 -0.0004 4.8128 11.1375 36.4926 54.8837
frequency: 10.0952 36.4600 54.8613 57.5199 61.9170 99.1291 129.2576 156.6797 197.7091 201.1767 231.7632 247.4526 257.2595 290.2726 314.9072 398.4024 403.6157 417.4374 426.6167 454.7714 502.9417 521.1056 561.2931 567.0308 572.6989 612.2212 615.8202 645.4145 651.1615 656.4269 679.1219 694.4456 705.8854 712.9225 738.6781 762.4957 773.1201 780.1008 785.3393 854.1569 854.4987 861.7003 888.5434 894.9085 912.2260 934.1769 938.4710 970.2656 982.7211 986.9307 988.2234 988.7181 1000.1136 1001.8013 1006.2762 1015.2499 1026.4883 1031.7917 1057.4848 1076.3009 1083.1947 1097.9665 1164.8622 1172.6108 1175.2834 1178.4511 1187.1789 1199.1243 1206.4886 1248.2701 1287.8102 1295.6088 1309.7839 1338.6640 1365.8110 1377.2982 1406.1454 1427.8440 1437.0104 1447.0423 1458.0828 1478.8765 1484.5170 1571.3727 1580.7076 1584.2426 1592.4325 1607.2714 1615.5355 1615.9893 1712.7518 3125.8200 3126.5854 3132.1953 3137.6878 3137.9704 3143.6112 3152.4416 3152.5302 3153.9946 3166.0416 3167.0067 3170.0321 3198.3598 3204.3516
redmass: 4.4500 4.7536 4.6026 5.0987 4.5210 5.7443 4.4953 7.5904 5.6808 5.8530 5.0408 8.3773 4.5021 5.5740 6.0333 2.8290 2.8569 3.2557 5.3638 3.7445 4.0153 7.3718 7.8193 4.3966 8.9429 6.3270 6.2879 6.4955 7.3247 5.0197 4.9265 1.6640 1.9836 5.0923 4.7642 3.9748 2.2623 1.5163 2.0119 5.1088 1.2622 1.2476 1.3841 6.3290 7.6008 1.5489 1.4333 1.3942 1.3893 5.7610 6.1618 1.3832 1.3143 1.3392 1.3292 3.1645 2.2302 2.2372 3.1571 1.6145 2.6310 1.6969 1.8623 1.0534 1.0579 1.2343 1.1214 2.8959 1.1337 3.5554 2.2788 1.9209 1.3780 1.4871 6.6586 6.6368 6.8783 2.1896 2.4052 2.5585 2.5759 2.3168 2.2494 5.6125 5.9872 7.0905 7.3814 6.1191 7.7810 7.0615 12.8852 1.0851 1.0848 1.0880 1.0868 1.0899 1.0926 1.0914 1.0968 1.0944 1.0988 1.1016 1.0989 1.0947 1.0937
irintensity: 1.2168 0.6100 0.8591 0.0032 0.1017 1.3510 0.3253 0.6897 0.0487 0.4283 0.2050 0.5601 0.2056 3.0381 2.1477 0.0612 0.1176 0.5918 2.2747 1.6854 1.7259 2.8365 1.3413 12.5712 3.2220 0.6124 0.3361 15.5679 9.0421 17.5278 4.7198 45.5998 38.4089 12.5393 2.6753 27.8000 61.9857 69.8300 17.2629 20.6333 0.7787 0.0991 1.4844 173.1323 79.5693 4.8958 2.8427 0.4532 0.0757 1.1811 2.2615 0.8323 0.0500 0.2163 0.6702 10.0812 1.8703 7.5675 21.3017 8.9546 9.5248 2.8761 21.1192 0.0116 0.2325 1.5982 0.7012 3.2166 15.8444 17.0683 4.1986 14.8829 0.6914 3.9247 0.0071 1.2927 45.5691 9.5004 13.4178 28.0814 36.3679 24.7705 20.2642 5.4725 1.3783 5.8167 30.8798 3.3149 7.3793 31.7982 548.2576 0.9740 1.0496 0.5328 3.2798 12.0729 15.4011 8.1539 26.5934 31.5890 28.1649 24.5853 22.0723 6.2050 9.1649
temp: 298.150 k
press: 1.00000 atm
elementType: 8 8 6 6 6 6 6 6 6 6 6 6 6 6 6 6 6 6 6 6 6 6 6 1 1 1 1 1 1 1 1 1 1 1 1 1 1
symmnumber: 1
zpe: 742482.8 jmol-1
zpe.correction: 0.282797 hartree
zpe.thermalcorrener: 0.300608 hartree
zpe.thermalcorrenthalpy: 0.301552 hartree
zpe.thermalcorrgfe: 0.234674 hartree
zpe.sumelectzpe: -957.544887 hartree
zpe.sumelectthermal: -957.527076 hartree
zpe.sumelectthermalent: -957.526132 hartree
zpe.sumelectthermalfe: -957.593010 hartree
dipole: 0.0882 5.6423 -0.2803
dipole: 5.6500
quadrupole: -114.2442 -132.8401 -131.6492
quadrupole: -10.1970 -0.0074 1.2927
quadrupole: 12.0003 -6.5956 -5.4047 -10.1970 -0.0074 1.2927
hfenergy: -957.8276839 hartree
pointgroup: C01 [X(C21H14O2)]
dipole: 0.2869857 2.1550173 0.4633713 debye
polarizability: 375.8156753|-6.5699543|276.4066666|-15.0110267|25.4627211|130.9002479 unknown
InChI: InChI=1S/C21H14O2/c22-21-18-14-8-7-13-17(18)20(23-21)19(15-9-3-1-4-10-15)16-11-5-2-6-12-16/h1-14H
charge 0 multiplicity 1
37 atoms
O  0.345977 -2.158293 -0.518128
O  1.841222 -3.920979 -0.952134
C  0.43998 -0.757382 -0.232706
C  -0.698379 0.002027 -0.037439
C  1.875359 -0.411182 -0.207171
C  2.612228 -1.599165 -0.486807
C  -2.098255 -0.492959 -0.044562
C  -0.492631 1.477026 0.195652
C  1.679697 -2.719029 -0.690999
C  2.584948 0.790245 0.044742
C  4.019012 -1.63092 -0.535866
C  -2.452939 -1.877597 -0.126987
C  -0.474717 2.005884 1.512056
C  -3.164127 0.457004 0.046112
C  -0.334763 2.361393 -0.902436
C  3.996475 0.76272 -0.000665
C  4.715152 -0.429095 -0.290022
C  -3.803705 -2.277504 -0.115274
C  -0.281231 3.389506 1.727569
C  -4.512403 0.049959 0.052363
C  -0.145651 3.745952 -0.688718
C  -4.843403 -1.322122 -0.026942
C  -0.114111 4.263789 0.627558
H  2.066508 1.72314 0.270411
H  4.540323 -2.567935 -0.756141
H  -1.66811 -2.630285 -0.203564
H  -0.606891 1.329063 2.363407
H  -2.93174 1.52435 0.108112
H  -0.356974 1.95898 -1.921273
H  4.550883 1.687652 0.193324
H  5.809564 -0.410406 -0.317979
H  -4.045451 -3.34449 -0.177633
H  -0.262567 3.783048 2.749938
H  -5.305057 0.803563 0.118855
H  -0.023783 4.416908 -1.546264
H  -5.891522 -1.641537 -0.020453
H  0.03418 5.336472 0.794262
