program: Gaussian 09
title: 000285980
version: EM64L-G09RevD.01
frameworkgroup: C1[X(C23H27ClN6O3)]
method: RPBEPBE
basis: SDD
operation: Freq
keyword: #p
keyword: freq=noraman
keyword: PBEPBE/SDD
title: #p freq=noraman PBEPBE/SDD
converged: YES YES NO NO
title: Mulliken charges:
elementType: Cl O O O N N N N N N C C C C C C C C C C C C C C C C C C C C C C C H H H H H H H H H H H H H H H H H H H H H H H H H H H
charge: -0.032662 -0.246347 -0.259309 -0.279927 -0.315700 -0.150839 -0.094507 -0.172967 -0.633155 -0.613989 0.187867 -0.392242 -0.357751 -0.685168 -0.705171 0.352388 -0.291739 -0.300872 0.230076 0.103653 -0.316508 -0.378997 0.290990 -0.023282 0.481802 0.475495 -0.327030 -0.320897 -0.493579 -0.465011 -0.379965 -0.447989 -0.214530 0.241137 0.261158 0.263584 0.226907 0.209980 0.232385 0.237566 0.227056 0.205541 0.242641 0.222973 0.197329 0.196729 0.224006 0.284100 0.262114 0.261830 0.267722 0.230254 0.229277 0.269580 0.335415 0.339586 0.237417 0.234491 0.320717 0.316365
chargesum: 0.00000
title: Mulliken charges with hydrogens summed into heavy atoms:
elementType: Cl O O O N N N N N N C C C C C C C C C C C C C C C C C C C C C C C
charge: -0.032662 -0.246347 -0.259309 -0.279927 -0.315700 -0.150839 -0.094507 -0.172967 0.041846 0.023093 0.187867 0.110053 0.132740 -0.005237 -0.029932 0.352388 0.128564 0.119863 0.230076 0.103653 -0.032408 -0.116883 0.290990 -0.023282 0.481802 0.475495 -0.327030 -0.059067 -0.225857 -0.005479 -0.110385 -0.210572 0.019961
polarizability: 4.67384073e+02 -9.13105411e+00 3.05494268e+02 -1.03572921e+01 3.96030198e+00 2.19760529e+02
1716.lowfreq: -2.0288 -0.0011 -0.0008 0.0004 1.3291 5.7079 7.7539 15.5487 17.8959
frequency: 6.6028 15.4683 17.6468 25.8703 37.6932 41.9593 48.6328 60.9929 72.3141 75.9203 88.4268 101.9210 118.7752 121.2900 146.1696 171.1439 180.6875 185.8403 200.0182 215.0906 218.0253 226.9826 257.6351 266.9367 274.8749 286.8746 291.4527 304.3234 314.0133 317.8316 337.0038 351.7501 366.4574 371.2569 381.6190 385.7313 386.9893 405.8896 422.2967 428.6651 449.3402 456.9881 469.1454 486.8408 502.9956 512.2158 517.9916 521.8275 531.1579 538.1451 554.2179 580.2052 587.0097 609.1806 621.9859 637.4849 662.6343 670.9230 683.7847 697.0917 715.5201 721.9652 725.6288 727.9692 790.7646 802.7367 808.5288 814.4427 822.1900 833.1889 843.3907 860.3071 888.1606 898.7213 909.9998 919.2903 931.2671 941.4683 945.6257 946.6406 958.9123 959.6318 989.5297 990.6577 990.8919 1008.2361 1011.3715 1016.2297 1028.8419 1048.6092 1050.3638 1072.1326 1092.4621 1102.2849 1104.8616 1119.6138 1129.7671 1135.6644 1144.6730 1175.9760 1183.1906 1189.2414 1190.6711 1199.7189 1212.0539 1214.0929 1245.9193 1250.2428 1253.9221 1267.1359 1276.8651 1288.8015 1303.8259 1326.5117 1336.0083 1344.3938 1352.4485 1361.0619 1366.4198 1369.0678 1385.0191 1386.1958 1399.1504 1403.8107 1407.4871 1432.2350 1444.9028 1446.1735 1449.4719 1453.0652 1457.4284 1459.2921 1465.9064 1468.2230 1470.3867 1475.1938 1477.2816 1485.3067 1532.3236 1549.0902 1552.1210 1569.6856 1599.6007 1603.3324 1610.5775 1614.4874 1617.3310 2948.9055 2954.1456 2958.1352 2972.6291 2980.4196 2982.4233 2998.0622 3017.3280 3079.8187 3086.0838 3088.2553 3092.6699 3094.5518 3100.7626 3104.0544 3110.4572 3123.4030 3146.9569 3148.2415 3154.8622 3168.4486 3170.3124 3174.9737 3554.0819 3567.8277 3708.8641 3730.1146
redmass: 8.2537 4.8169 5.5659 5.9414 5.6727 5.0207 5.6400 4.8013 4.0332 5.1505 6.3094 4.6220 5.1586 5.1809 5.3893 6.1094 5.2166 3.2320 3.8686 2.5556 5.4078 1.3879 3.5035 1.0424 4.2093 2.9027 4.0379 2.6260 2.8445 2.8948 3.4210 6.5131 4.9971 1.2856 1.4933 3.5712 2.9802 2.1462 3.2161 3.8449 3.2111 2.8261 3.6901 3.1389 1.9833 2.2507 4.0405 1.5668 2.2500 2.7192 3.3382 4.0724 4.1406 4.6053 4.7636 3.4353 6.4249 8.1238 4.1146 4.9205 3.9153 2.3315 10.9782 5.8098 4.2849 2.4534 1.8416 2.7075 2.7467 1.6904 4.3293 2.8227 1.4932 2.0293 1.5861 1.6533 1.5007 2.6917 1.6122 1.8125 7.1400 3.3199 2.8511 1.3743 1.8264 1.8284 2.2545 2.2838 2.8495 2.0883 3.4013 3.8657 1.9206 1.8818 1.9472 2.2278 2.0465 1.8015 1.3347 3.1997 1.0896 1.0710 3.4383 1.2940 1.5190 1.8201 2.8838 1.8223 1.9128 1.5576 1.5921 3.1525 1.2974 1.2437 4.4920 1.2328 1.3918 1.8146 1.2286 1.3182 1.3047 4.7450 4.2647 4.5504 2.7434 2.9771 1.1499 3.4555 1.0573 1.1053 1.0941 1.0921 1.1327 1.3430 1.0886 1.0643 2.3630 2.0020 2.5532 7.2131 8.8758 1.7191 6.2039 3.5382 3.4515 6.1105 2.1859 1.0582 1.0686 1.0687 1.0680 1.0350 1.0659 1.0354 1.1036 1.1003 1.0942 1.0979 1.0975 1.0997 1.1006 1.0927 1.0992 1.0887 1.0916 1.0913 1.0880 1.0984 1.0929 1.0963 1.0444 1.0437 1.1052 1.1058
irintensity: 0.3150 0.2393 1.1042 1.1338 0.3452 0.5572 0.1707 0.6294 0.9540 2.7698 1.8050 2.5497 0.3620 0.8611 2.7277 0.0137 4.0747 4.4242 3.9875 1.0303 0.5824 0.4957 3.5482 0.2252 9.1812 6.4207 2.0507 9.0209 3.4105 8.1183 6.6641 18.0841 1.8450 113.4304 224.7658 20.9593 17.5137 2.1319 10.8376 14.2593 6.3922 0.4248 4.4077 16.8010 31.4974 35.3512 2.4193 1.7367 27.6531 8.5623 14.9281 25.5875 5.1426 8.4600 0.0215 6.8861 2.1289 0.6514 7.9892 16.8406 21.2275 51.0637 32.8767 33.3821 15.2299 28.7762 11.5582 75.4136 28.5585 1.4002 0.0303 7.0828 4.1304 4.0208 1.2258 5.7684 3.6047 14.9035 8.3774 9.6999 122.0640 15.8662 0.6381 0.0497 1.3341 6.3989 16.2699 34.4550 39.0170 44.1903 13.3963 48.6888 25.9191 0.8699 5.9838 3.7900 54.0854 14.4186 28.2722 1.5982 3.0998 1.0292 29.3821 38.9887 74.4990 167.5462 173.6482 44.8393 76.3710 48.0093 86.5026 15.3265 7.1346 1.5811 12.1705 7.1434 9.8418 53.8923 34.1624 2.3269 31.7008 30.0013 153.2690 324.0447 124.9710 15.8208 31.4045 120.9095 0.9610 18.6895 3.5505 8.8301 24.6390 186.1206 11.4797 23.8594 2.2842 189.0192 288.7940 21.0363 243.3620 178.1943 8.9309 331.0633 329.3055 3.4303 477.2224 26.5766 54.7018 41.0541 58.7723 15.9960 72.9115 17.6689 22.1530 28.7257 43.6581 8.2397 29.1887 13.2656 32.2771 10.8202 32.0298 8.7445 13.2874 3.7227 11.4076 13.7783 1.7629 3.8233 56.3873 92.9211 57.8191 37.5376
temp: 298.150 k
press: 1.00000 atm
elementType: 17 8 8 8 7 7 7 7 7 7 6 6 6 6 6 6 6 6 6 6 6 6 6 6 6 6 6 6 6 6 6 6 6 1 1 1 1 1 1 1 1 1 1 1 1 1 1 1 1 1 1 1 1 1 1 1 1 1 1 1
symmnumber: 1
zpe: 1248675.3 jmol-1
zpe.correction: 0.475595 hartree
zpe.thermalcorrener: 0.507313 hartree
zpe.thermalcorrenthalpy: 0.508258 hartree
zpe.thermalcorrgfe: 0.408891 hartree
zpe.sumelectzpe: -1904.462806 hartree
zpe.sumelectthermal: -1904.431088 hartree
zpe.sumelectthermalent: -1904.430144 hartree
zpe.sumelectthermalfe: -1904.529510 hartree
dipole: 0.2355 2.4036 -0.9058
dipole: 2.5794
quadrupole: -235.4810 -190.9088 -198.3617
quadrupole: -1.2570 -19.1765 5.7358
quadrupole: -27.2305 17.3417 9.8888 -1.2570 -19.1765 5.7358
hfenergy: -1904.9384012 hartree
pointgroup: C01 [X(C23H27Cl1N6O3)]
dipole: 0.1206165 -0.928141 0.3922443 debye
polarizability: 466.9169774|13.807503|306.2913047|7.874219|0.7300545|219.4305875 unknown
InChI: InChI=1S/C23H27ClN6O3/c1-23(2)28-21(25)27-22(26)30(23)17-6-7-19(18(24)13-17)33-14-15-4-3-5-16(12-15)20(31)29-8-10-32-11-9-29/h3-7,12-13H,8-11,14,25-26H2,1-2H3
charge 0 multiplicity 1
60 atoms
Cl -0.236374 1.472532 -1.547614
O  -4.592803 3.73447 -0.510988
O  -0.863986 -1.115321 -0.245057
O  -6.96823 -0.281874 1.305026
N  4.631416 0.316901 0.087892
N  -5.624313 1.093669 -0.008094
N  6.980531 -0.057252 -0.618937
N  6.426028 1.346205 1.319442
N  4.228874 1.594734 2.054443
N  8.623333 0.710216 0.868594
C  5.595792 0.052271 -1.097657
C  -4.727156 1.341952 -1.16143
C  -6.417022 2.287475 0.370183
C  5.478048 1.237762 -2.096678
C  5.213807 -1.277082 -1.775222
C  3.245239 -0.058138 0.024829
C  -3.805264 2.538644 -0.853885
C  -5.460121 3.461179 0.649791
C  5.125907 1.089375 1.134365
C  -5.953452 -0.141705 0.54546
C  2.297905 0.775773 -0.632116
C  2.798995 -1.265831 0.612984
C  -5.06042 -1.326094 0.260766
C  7.302224 0.643671 0.46173
C  0.493167 -0.824717 -0.117502
C  -2.859009 -2.419315 0.194523
C  0.951791 0.388295 -0.698205
C  1.443495 -1.647611 0.542781
C  -3.651106 -1.260805 0.378035
C  -1.358588 -2.362387 0.383248
C  -5.680946 -2.572795 -0.009315
C  -3.485591 -3.648382 -0.119028
C  -4.8947 -3.725056 -0.21095
H  -5.351048 1.588217 -2.045971
H  -4.13413 0.446015 -1.396659
H  -7.024049 2.031925 1.254315
H  -7.102102 2.555448 -0.459651
H  4.469094 1.293626 -2.545496
H  5.706882 2.191419 -1.588107
H  6.213128 1.095538 -2.907597
H  5.285609 -2.109422 -1.054869
H  4.199077 -1.249959 -2.208826
H  5.943247 -1.46224 -2.580507
H  -3.213917 2.81893 -1.740218
H  -3.116665 2.282818 -0.019983
H  -4.835735 3.232952 1.540609
H  -6.020863 4.394356 0.821906
H  2.618915 1.718464 -1.08443
H  3.52706 -1.905771 1.120577
H  1.13187 -2.591202 0.998764
H  -3.158156 -0.313958 0.622388
H  -0.866788 -3.237442 -0.085513
H  -1.092987 -2.340623 1.461532
H  -6.773845 -2.621587 -0.045531
H  4.621856 2.098212 2.845596
H  3.223372 1.522702 1.927458
H  -2.878407 -4.547041 -0.28307
H  -5.375446 -4.682099 -0.439207
H  8.844038 1.178472 1.741923
H  9.337215 0.249487 0.312353
