program: Gaussian 09
title: 000285895
version: EM64L-G09RevD.01
frameworkgroup: C1[X(C12H16N2O)]
method: RPBEPBE
basis: SDD
operation: Freq
keyword: #p
keyword: freq=noraman
keyword: PBEPBE/SDD
title: #p freq=noraman PBEPBE/SDD
converged: YES YES NO NO
title: Mulliken charges:
elementType: O N N C C C C C C C C C C C C H H H H H H H H H H H H H H H H
charge: -0.428402 -0.173569 -0.085708 0.136436 -0.527228 -0.471950 -0.548637 0.148455 0.273353 0.281586 -0.362434 -0.428099 -0.335795 -0.653561 -0.646805 0.238790 0.208966 0.218567 0.224471 0.227638 0.224386 0.237158 0.257641 0.238637 0.224644 0.211044 0.247533 0.261892 0.215972 0.222359 0.362662
chargesum: 0.00000
title: Mulliken charges with hydrogens summed into heavy atoms:
elementType: O N N C C C C C C C C C C C C
charge: -0.065739 -0.173569 -0.085708 0.136436 -0.079473 -0.028912 -0.096612 0.148455 0.273353 0.281586 -0.125276 -0.170459 -0.097158 0.029660 0.053418
polarizability: 2.65796497e+02 -3.20210331e+00 1.56991501e+02 -5.21495243e-01 2.05010241e+00 8.21183706e+01
1716.lowfreq: -6.3914 -4.1523 0.0005 0.0008 0.0008 5.3720 53.2025 80.3132 83.5262
frequency: 53.1781 80.2855 83.5088 104.4221 113.8252 140.1216 170.0144 191.9003 210.5504 235.7093 255.8583 284.3749 286.8181 321.2115 369.0940 399.7881 404.7614 418.4911 497.5276 513.8227 523.6954 558.5671 608.8258 633.3684 663.2447 741.7980 772.2104 825.5314 850.9148 870.1916 896.6939 901.0338 925.1174 945.6722 960.9995 965.8163 1017.3866 1026.9028 1045.5682 1053.7059 1091.0751 1129.1771 1132.5580 1160.8727 1172.0606 1179.9784 1207.5817 1215.9394 1222.5780 1229.3519 1275.0996 1283.4999 1288.2560 1317.5024 1356.4173 1371.7955 1402.0231 1414.2386 1428.4648 1448.8259 1457.0740 1464.3167 1470.6800 1475.5222 1478.5738 1483.8390 1491.1865 1514.5110 1547.2485 1583.6019 1612.8270 2906.8612 2917.3877 2946.9357 2967.2850 3003.3996 3022.2469 3030.0598 3033.7146 3043.9265 3070.9977 3074.4335 3089.2521 3138.3929 3141.8715 3164.8230 3572.0694
redmass: 3.3909 2.8809 1.4702 4.0946 2.6305 3.1873 2.1243 2.6175 2.9334 2.2535 1.4310 5.1836 2.5036 3.6352 4.3927 3.1289 1.4808 2.1775 3.5595 3.9370 4.0806 2.9096 3.6360 4.3374 2.7479 3.7717 4.7212 1.4796 2.3052 2.8812 6.7295 1.8998 2.4843 1.4780 2.7176 1.4382 2.4250 2.1597 1.7576 1.4679 1.2431 1.2839 1.3448 1.7443 2.3034 1.6842 1.3193 1.4887 1.3990 2.3558 1.6096 1.7915 1.2804 1.4174 2.8957 2.6604 3.0537 3.9673 1.1521 1.2802 1.0845 1.1045 1.0556 1.0901 1.1830 1.0815 1.2724 1.8047 7.4878 7.2942 6.8561 1.0515 1.0537 1.0671 1.0662 1.0644 1.0851 1.0801 1.0924 1.0935 1.0888 1.1043 1.1004 1.0928 1.0869 1.0955 1.0674
irintensity: 2.1185 5.2041 1.7519 0.4645 0.3556 0.1569 2.6703 1.3240 0.1905 11.2428 0.1829 1.9361 2.4091 4.6669 22.5462 4.9191 117.0230 48.8523 12.8442 2.7234 1.3139 6.7588 4.8851 9.8633 8.0871 2.0676 82.5394 42.2262 2.9832 20.5303 156.7771 2.0252 4.4516 15.9169 2.1178 5.6929 69.3510 13.3148 16.8115 12.2524 11.7458 14.6265 54.8111 21.2940 0.4436 15.9844 53.9435 27.1935 7.4132 17.8998 37.7460 1.8977 1.8729 0.3412 124.8049 2.2780 2.2604 13.5104 3.4711 12.3495 8.5698 7.1710 18.4985 28.8876 49.6289 4.2560 2.7820 104.5971 18.9720 8.2796 189.1789 80.4474 219.3317 53.4063 29.3135 36.8287 41.7792 35.7821 44.3924 28.3390 21.9509 49.7267 24.1979 9.7261 4.3912 16.2337 82.3097
temp: 298.150 k
press: 1.00000 atm
elementType: 8 7 7 6 6 6 6 6 6 6 6 6 6 6 6 1 1 1 1 1 1 1 1 1 1 1 1 1 1 1 1
symmnumber: 1
zpe: 675608.0 jmol-1
zpe.correction: 0.257326 hartree
zpe.thermalcorrener: 0.272239 hartree
zpe.thermalcorrenthalpy: 0.273183 hartree
zpe.thermalcorrgfe: 0.215702 hartree
zpe.sumelectzpe: -650.424052 hartree
zpe.sumelectthermal: -650.409139 hartree
zpe.sumelectthermalent: -650.408195 hartree
zpe.sumelectthermalfe: -650.465675 hartree
dipole: -3.5500 0.2373 0.3483
dipole: 3.5750
quadrupole: -80.1087 -80.7851 -92.2646
quadrupole: 0.1304 -1.6966 1.1745
quadrupole: 4.2774 3.6010 -7.8784 0.1304 -1.6966 1.1745
hfenergy: -650.6813776 hartree
pointgroup: C01 [X(C12H16N2O1)]
dipole: -1.3963266 0.0632521 0.1565715 debye
polarizability: 265.8279454|-1.7980502|155.7889855|-2.3753209|9.4182638|83.2894374 unknown
InChI: InChI=1S/C12H16N2O/c1-14(2)12-7-6-9(8-13-15)10-4-3-5-11(10)12/h6-8,15H,3-5H2,1-2H3
charge 0 multiplicity 1
31 atoms
O  5.044799 -0.604578 -0.012312
N  -2.905691 -0.757596 -0.18358
N  3.660136 -1.092586 -0.136219
C  -0.904205 0.709109 0.057984
C  -1.575249 2.078038 0.147057
C  -0.424581 3.063897 -0.212911
C  0.877363 2.329571 0.223115
C  0.503008 0.855987 0.085961
C  -1.50147 -0.57708 -0.111769
C  1.378834 -0.256984 -0.043856
C  -0.612913 -1.690512 -0.2797
C  0.779509 -1.535177 -0.242467
C  2.83064 -0.076717 0.017685
C  -3.433924 -2.014766 -0.733221
C  -3.795805 -0.143659 0.819002
H  -2.445876 2.169962 -0.528358
H  -1.937734 2.285947 1.176479
H  -0.542385 4.050918 0.26776
H  -0.404925 3.219423 -1.307662
H  1.132699 2.56943 1.276171
H  1.746562 2.61878 -0.394435
H  -1.024851 -2.695319 -0.411866
H  1.430885 -2.408334 -0.354239
H  3.230157 0.932837 0.203697
H  -4.499072 -1.869467 -0.988582
H  -3.37005 -2.870273 -0.021647
H  -2.895521 -2.286508 -1.656419
H  -3.37804 0.799109 1.194355
H  -3.950828 -0.816577 1.692982
H  -4.784348 0.06915 0.370571
H  5.573374 -1.432625 -0.145077
