program: Gaussian 09
title: 000285907
version: EM64L-G09RevD.01
frameworkgroup: C1[X(C15H12Br2O2)]
method: RPBEPBE
basis: SDD
operation: Freq
keyword: #p
keyword: freq=noraman
keyword: PBEPBE/SDD
title: #p freq=noraman PBEPBE/SDD
converged: YES YES NO NO
title: Mulliken charges:
elementType: Br Br O O C C C C C C C C C C C C C C C H H H H H H H H H H H H
charge: -0.005857 -0.014746 -0.465790 -0.246145 -0.688702 -0.652628 0.540621 0.608153 0.044917 -0.278330 -0.406866 -0.309081 -0.327345 -0.248387 -0.231352 -0.223226 -0.239775 0.118380 -0.232758 0.407961 0.314167 0.231653 0.227695 0.231543 0.280495 0.237346 0.241544 0.231322 0.229353 0.232983 0.392857
chargesum: 0.00000
title: Mulliken charges with hydrogens summed into heavy atoms:
elementType: Br Br O O C C C C C C C C C C C C C C C
charge: -0.005857 -0.014746 -0.072933 -0.246145 -0.280742 -0.338461 0.540621 0.608153 0.044917 -0.046677 -0.179171 -0.077539 -0.046850 -0.011041 0.010191 0.008096 -0.010422 0.118380 0.000225
polarizability: 2.65050138e+02 3.29534122e+01 1.62728241e+02 -5.74766218e+00 -4.90563393e+00 1.94669356e+02
1716.lowfreq: -0.7158 -0.0007 -0.0006 -0.0002 3.9220 5.3622 15.0752 26.9983 34.6227
frequency: 15.0082 26.9561 34.6162 36.8927 53.6301 68.3144 98.3263 108.3080 131.2337 159.8875 193.9069 205.4250 227.2939 252.1263 278.7139 377.7893 400.5277 418.7463 422.3450 464.7850 479.2733 531.2131 550.8884 577.6440 592.9907 603.7785 613.4578 620.1790 639.4894 692.1580 696.2593 726.3576 770.3021 777.8210 787.5913 820.4811 844.5538 850.4492 896.4612 923.4686 975.0262 981.0876 990.2706 997.7853 1007.1343 1008.9120 1025.1596 1048.9520 1061.2345 1081.1193 1099.1326 1136.3668 1168.3307 1174.0385 1179.0612 1180.9006 1193.0014 1215.5648 1225.7044 1256.3998 1296.0792 1307.4499 1329.5145 1367.7420 1389.9873 1404.6239 1441.1472 1447.3756 1483.2532 1485.9733 1574.2660 1593.6839 1607.2776 1611.4073 1631.0988 3094.1594 3123.1921 3129.3009 3135.8853 3140.3598 3148.8012 3152.0877 3157.5918 3160.9641 3167.7991 3174.6972 3513.4811
redmass: 9.5868 7.9535 7.7429 5.0680 6.4092 8.8673 10.2692 7.6624 5.2243 17.5598 5.9433 6.2056 5.3362 5.2519 6.6322 8.0787 2.7571 3.5548 4.1177 5.6349 4.0408 5.2478 6.1968 3.3496 1.4244 4.7791 5.1859 5.6257 4.7026 2.8802 1.7185 5.2690 2.5582 2.0023 1.8442 4.8372 1.2752 3.9597 1.5093 1.4605 1.4020 1.3934 6.0956 1.3361 4.5620 1.4461 2.5024 3.6589 2.1371 1.8488 1.9114 1.1451 1.5428 1.0913 1.1622 1.0693 1.1191 2.4926 2.1028 1.4780 1.6665 2.3581 1.4290 2.5997 6.2583 2.1091 2.2251 2.1251 2.3620 2.2850 6.4397 5.9339 6.0420 6.0073 7.8398 1.0870 1.0870 1.0865 1.0858 1.0915 1.0898 1.0961 1.0862 1.0946 1.1016 1.1002 1.0638
irintensity: 0.6149 0.2486 0.4019 0.4892 1.7712 0.0147 0.8295 3.7706 1.8941 0.0694 0.2105 1.2189 2.8096 1.4672 1.3062 10.4368 0.2017 1.0554 30.5236 37.1685 6.8069 7.4855 39.8868 48.4174 114.6242 29.2192 10.7079 2.9533 0.8365 50.6460 103.3462 5.0072 18.8288 25.9124 17.9210 19.9932 0.0546 0.6169 1.3077 0.5125 0.2696 1.0811 0.8087 0.1789 146.7016 15.7059 2.7824 3.6095 20.7239 2.9115 32.0499 26.6699 65.7725 4.5814 17.9312 0.8042 9.1425 70.9831 8.0124 2.8212 7.3972 61.3131 7.4960 19.8654 5.2426 2.8843 9.8967 16.3433 5.5040 1.0532 11.3784 0.8889 97.1821 1.9967 230.8460 5.1134 5.8653 1.6264 2.4074 14.0661 13.3531 43.1534 24.9476 5.5483 23.6883 18.3103 45.8426
temp: 298.150 k
press: 1.00000 atm
elementType: 35 35 8 8 6 6 6 6 6 6 6 6 6 6 6 6 6 6 6 1 1 1 1 1 1 1 1 1 1 1 1
symmnumber: 1
zpe: 598396.2 jmol-1
zpe.correction: 0.227917 hartree
zpe.thermalcorrener: 0.245788 hartree
zpe.thermalcorrenthalpy: 0.246732 hartree
zpe.thermalcorrgfe: 0.177260 hartree
zpe.sumelectzpe: -754.836777 hartree
zpe.sumelectthermal: -754.818906 hartree
zpe.sumelectthermalent: -754.817961 hartree
zpe.sumelectthermalfe: -754.887434 hartree
dipole: -1.3084 -0.1219 -1.2646
dipole: 1.8237
quadrupole: -116.3834 -142.5267 -113.2029
quadrupole: 3.4788 -10.9559 -3.7015
quadrupole: 7.6542 -18.4890 10.8348 3.4788 -10.9559 -3.7015
hfenergy: -755.064694 hartree
pointgroup: C01 [X(C15H12Br2O2)]
dipole: 0.5016369 0.5051138 0.0896344 debye
polarizability: 264.7591586|-6.4282058|194.8590806|33.5002466|-1.757273|162.8294959 unknown
InChI: InChI=1S/C15H12Br2O2/c16-13(10-6-2-1-3-7-10)14(17)11-8-4-5-9-12(11)15(18)19/h1-9,13-14,18H
charge 0 multiplicity 1
31 atoms
Br 0.290835 0.493466 2.467852
Br 0.46283 0.391991 -2.357597
O  -1.319614 -2.490569 0.329846
O  -3.585977 -2.688301 -0.011442
C  -0.136812 0.065504 0.466824
C  0.954112 0.768853 -0.346268
C  -1.56947 0.488091 0.214847
C  2.374255 0.321974 -0.122921
C  -2.654994 -0.436158 0.064006
C  -1.859809 1.876289 0.142843
C  3.400262 1.299199 -0.069246
C  2.719291 -1.048203 0.015809
C  -3.968994 0.063799 -0.168638
C  -3.161521 2.35674 -0.086004
C  -4.227998 1.441941 -0.246714
C  4.74473 0.920138 0.133732
C  4.061578 -1.427726 0.215782
C  -2.592297 -1.931918 0.116929
C  5.07937 -0.445535 0.277123
H  -0.026027 -1.022522 0.442492
H  0.866816 1.864744 -0.30522
H  -1.048861 2.596616 0.293045
H  3.143288 2.359617 -0.1818
H  1.943479 -1.819564 -0.047353
H  -4.77584 -0.666284 -0.284495
H  -3.345109 3.435361 -0.134571
H  -5.246833 1.800269 -0.425369
H  5.52689 1.685605 0.178881
H  4.317889 -2.487508 0.321606
H  6.122171 -0.743325 0.432476
H  -1.418336 -3.480979 0.353141
