program: Gaussian 09
title: 000285890
version: EM64L-G09RevD.01
frameworkgroup: C1[X(C16H16O)]
method: RPBEPBE
basis: SDD
operation: Freq
keyword: #pfreq=noraman
keyword: PBEPBE/SDD
title: #p freq=noraman PBEPBE/SDD
converged: YES YES NO NO
title: Mulliken charges:
elementType: O C C C C C C C C C C C C C C C C H H H H H H H H H H H H H H H H
charge: -0.437655 -0.558097 -0.446761 0.287261 -0.545082 0.285924 -0.556568 0.472392 -0.430350 -0.372654 -0.447073 0.361725 -0.373383 -0.417022 -0.233478 -0.219653 -0.247620 0.225726 0.229072 0.224408 0.218593 0.227528 0.226369 0.272172 0.239911 0.239890 0.234928 0.249149 0.274793 0.339312 0.224689 0.224570 0.226983
chargesum: 0.00000
title: Mulliken charges with hydrogens summed into heavy atoms:
elementType: O C C C C C C C C C C C C C C C C
charge: -0.098342 -0.103300 -0.003760 0.287261 -0.091185 0.285924 -0.284396 0.472392 -0.190439 -0.132764 -0.212145 0.361725 -0.124234 -0.142229 -0.008789 0.004917 -0.020637
polarizability: 2.19588062e+02 5.69759020e+00 1.56706985e+02 -1.82837683e+01 -4.02670337e+00 1.27910466e+02
1716.lowfreq: -0.0007 0.0005 0.0007 0.8393 6.2490 9.4855 28.8661 34.8780 52.5055
frequency: 28.6880 34.5770 52.4906 105.7449 149.9249 167.4291 182.9175 214.3015 254.0437 265.7008 286.6973 343.8490 394.3621 407.0562 412.5936 447.3929 453.4985 517.1771 581.0851 586.6651 615.7761 620.1040 639.5034 705.1988 719.6148 726.0160 753.7207 789.0066 828.4830 840.7288 853.3596 861.6363 876.0489 907.2098 917.0203 920.5229 934.9783 950.0754 957.5745 984.7542 989.7355 1000.7099 1018.6956 1026.6320 1049.2008 1078.3776 1091.1533 1126.1402 1137.6991 1165.6048 1168.9093 1180.9298 1192.7859 1198.6756 1202.0412 1211.3138 1235.9924 1258.6263 1278.3764 1285.7780 1303.0721 1309.9298 1319.6726 1355.2432 1381.4521 1389.7383 1428.4884 1434.3148 1459.1499 1459.7762 1478.6128 1480.4762 1487.5828 1588.8019 1592.3200 1612.0400 1621.4977 2971.7903 2972.4212 3004.4509 3016.4068 3044.4691 3047.0730 3077.4449 3117.9938 3118.8593 3119.4586 3127.3673 3140.2656 3141.7351 3153.4506 3164.6256 3539.3805
redmass: 4.0586 3.7891 4.4297 4.1168 2.8091 2.7215 3.9005 3.2622 2.1227 4.6767 1.3604 4.8310 3.6869 2.8486 3.1475 3.7733 3.5695 4.4662 5.0802 2.8807 6.1358 2.9794 4.0754 2.8947 1.8566 2.5273 2.6611 2.8076 1.8979 2.4760 2.2411 1.2556 1.5619 2.1023 2.2428 2.0596 1.4798 3.2258 1.4842 1.5366 3.8226 1.3401 2.3143 2.1376 1.6805 1.6027 2.6242 1.3358 1.5970 1.2473 1.0771 1.2039 1.5159 1.6551 1.5490 1.4172 1.6963 1.3397 1.4896 2.4505 1.4479 1.3405 1.4594 1.3094 6.2932 4.1083 3.3124 2.3242 1.0914 1.1839 2.2632 1.1019 2.4611 6.5284 6.7687 6.1077 7.1554 1.0661 1.0654 1.0647 1.0841 1.0962 1.0933 1.1041 1.0889 1.0892 1.0852 1.0878 1.0932 1.0968 1.0953 1.1001 1.0661
irintensity: 0.3440 0.3520 0.2877 0.5913 0.6495 0.0693 2.0572 1.2115 18.1080 12.0549 144.2613 20.3205 1.4813 2.6425 4.2458 2.0480 3.8166 6.2575 19.3036 3.7438 0.1132 4.1851 7.3506 11.8809 87.9747 17.5683 5.2182 10.5493 19.0098 28.6298 9.2107 1.3659 13.8208 16.4368 20.8015 3.7321 8.5562 26.7591 6.2039 0.1997 0.3619 0.7845 2.1804 8.3748 3.7934 3.5669 6.0271 2.4203 8.1073 2.5316 1.8466 8.3716 27.2838 8.5767 16.1569 0.7760 1.8362 17.5669 10.6166 9.5705 5.0196 0.9894 11.5633 30.1284 4.3528 2.3422 6.1724 14.2117 12.1522 7.0216 14.2761 8.9079 19.7958 1.2287 0.4360 5.7131 0.4795 33.7122 35.9297 35.8903 14.5449 23.1575 38.4180 54.0740 3.7206 19.5545 0.3151 4.2548 31.3774 21.2818 21.5300 22.8758 7.7589
temp: 298.150 k
press: 1.00000 atm
elementType: 8 6 6 6 6 6 6 6 6 6 6 6 6 6 6 6 6 1 1 1 1 1 1 1 1 1 1 1 1 1 1 1 1
symmnumber: 1
zpe: 715631.6 jmol-1
zpe.correction: 0.272570 hartree
zpe.thermalcorrener: 0.286969 hartree
zpe.thermalcorrenthalpy: 0.287913 hartree
zpe.thermalcorrgfe: 0.230048 hartree
zpe.sumelectzpe: -693.318930 hartree
zpe.sumelectthermal: -693.304531 hartree
zpe.sumelectthermalent: -693.303587 hartree
zpe.sumelectthermalfe: -693.361452 hartree
dipole: 2.0248 -2.0576 0.0388
dipole: 2.8871
quadrupole: -91.6872 -102.3169 -95.6989
quadrupole: 4.2519 -1.6181 -2.4880
quadrupole: 4.8805 -5.7492 0.8687 4.2519 -1.6181 -2.4880
hfenergy: -693.5914999 hartree
pointgroup: C01 [X(C16H16O1)]
dipole: -0.7973068 -0.748085 0.3079665 debye
polarizability: 216.7479656|-13.3556298|156.5865697|-20.8977619|-4.8271999|130.8709779 unknown
InChI: InChI=1S/C16H16O/c17-16(13-5-2-1-3-6-13)15-10-9-12-7-4-8-14(12)11-15/h1-3,5-6,9-11,16-17H,4,7-8H2
charge 0 multiplicity 1
33 atoms
O  1.218296 1.757161 -2.006669
C  -2.940922 -1.844091 -0.330055
C  -4.220238 -1.619329 0.536675
C  -2.170264 -0.540738 -0.155025
C  -4.437593 -0.072864 0.544177
C  -3.029507 0.474281 0.345703
C  -0.817425 -0.263932 -0.425896
C  -0.306482 1.044154 -0.199157
C  -2.533293 1.773206 0.573009
C  1.133737 1.398703 -0.564892
C  -1.172979 2.050242 0.297502
C  2.179841 0.338611 -0.186439
C  2.135465 -0.300731 1.079847
C  3.245135 0.035924 -1.068878
C  3.133205 -1.228331 1.451856
C  4.239968 -0.899139 -0.700667
C  4.1889 -1.534439 0.560891
H  -3.211256 -1.988033 -1.396376
H  -2.365802 -2.73521 -0.020411
H  -4.026109 -1.964758 1.569271
H  -5.096639 -2.171834 0.155908
H  -4.917548 0.286973 1.472025
H  -5.08986 0.236165 -0.298384
H  -0.147534 -1.0559 -0.783158
H  -3.186625 2.561944 0.963765
H  1.402284 2.351552 -0.071615
H  -0.775729 3.058937 0.464656
H  1.315634 -0.075257 1.772251
H  3.287619 0.550362 -2.034208
H  0.746071 1.054204 -2.524456
H  3.086351 -1.713502 2.433646
H  5.057457 -1.124973 -1.395163
H  4.961643 -2.256456 0.848365
