program: Gaussian 09
title: 000285873
version: EM64L-G09RevD.01
frameworkgroup: C1[X(C11H18Si)]
method: RPBEPBE
basis: SDD
operation: Freq
keyword: #p
keyword: freq=noraman
keyword: PBEPBE/SDD
title: #p freq=noraman PBEPBE/SDD
converged: YES YES NO NO
title: Mulliken charges:
elementType: Si C C C C C C C C C C C H H H H H H H H H H H H H H H H H H
charge: 1.292116 -0.795227 -0.534263 -1.027226 -1.025478 -1.015975 0.512466 -0.413136 -0.418406 -0.227797 -0.226671 -0.245218 0.235957 0.235533 0.211603 0.210474 0.232277 0.234094 0.235259 0.235080 0.233471 0.232532 0.233381 0.233107 0.232420 0.229998 0.230197 0.221785 0.221851 0.225792
chargesum: 0.00000
title: Mulliken charges with hydrogens summed into heavy atoms:
elementType: Si C C C C C C C C C C C
charge: 1.292116 -0.323737 -0.112187 -0.325595 -0.324393 -0.317066 0.512466 -0.183138 -0.188209 -0.006012 -0.004819 -0.019425
polarizability: 1.81220517e+02 -8.15743474e-02 1.38357752e+02 -9.54198106e+00 1.24390949e-01 1.02001113e+02
1716.lowfreq: -8.9855 -0.0025 -0.0020 -0.0019 7.9619 16.4499 24.9571 36.5855 61.3267
frequency: 23.7983 36.2760 61.3062 64.6765 111.4419 119.7948 128.6288 135.9029 174.9036 182.0717 203.7713 222.1726 274.0898 294.8604 336.9686 402.5605 495.5895 540.9831 592.8058 617.1988 673.9668 687.9106 696.5282 698.6346 707.6205 736.2552 763.4289 789.7650 800.9317 831.0145 851.7487 887.1541 899.7249 916.8570 924.0913 939.2656 974.1206 989.5738 991.7215 1004.6759 1026.1760 1069.1418 1132.2047 1170.9436 1185.8126 1203.6962 1216.3998 1272.6851 1289.7853 1292.7921 1304.1432 1310.2348 1327.7029 1382.6805 1436.6309 1439.9282 1443.8143 1446.6656 1447.5692 1456.2617 1457.8906 1462.0497 1479.0215 1482.9433 1592.5074 1612.9388 2969.7670 2976.2878 2977.2710 2978.5883 2980.1436 3018.2872 3044.2970 3078.0191 3078.7920 3079.4999 3081.2351 3081.9223 3082.1656 3111.9051 3112.3010 3129.4882 3140.5701 3160.2423
redmass: 3.2922 3.3944 2.3509 3.3369 1.0600 3.5804 1.0259 1.0352 2.7651 2.2447 2.6183 2.2979 3.5558 3.5422 2.4039 2.8153 3.2234 5.0297 3.8492 6.3672 1.9010 3.5428 2.8229 1.6411 1.5385 1.1676 2.4301 1.7249 1.2988 2.0592 1.2484 1.3782 1.5268 1.4917 1.6522 1.6893 1.3883 6.2045 1.3502 4.2001 2.1841 1.5082 1.1452 1.0517 1.1159 1.3160 2.5964 1.2001 1.2085 1.2052 1.1942 1.3676 1.2457 7.5224 1.0719 2.0261 1.0847 1.0593 1.0559 1.0510 1.0517 1.0477 1.4857 1.5050 6.0215 6.1818 1.0583 1.0344 1.0345 1.0345 1.0586 1.0997 1.1028 1.0982 1.0984 1.0985 1.0978 1.0976 1.0978 1.0866 1.0870 1.0907 1.0958 1.1014
irintensity: 0.0088 0.0040 0.0327 0.0429 0.0246 0.6972 0.0266 0.0220 0.6204 0.0044 2.5421 2.0363 4.6016 0.6588 0.0059 0.0004 11.2258 0.6604 4.5632 0.0471 1.5407 7.5250 5.4446 9.3366 69.2259 0.0406 27.3744 29.8626 15.4766 1.1387 0.0169 29.8221 83.5604 42.2446 177.3546 64.8418 0.2365 0.0736 0.8896 8.5913 5.1372 1.2044 13.3916 0.1637 0.1691 33.3925 0.2041 2.3157 42.7742 47.3085 16.4425 4.4155 0.0673 0.0954 1.6348 6.1488 0.0364 0.0519 0.3493 9.6852 16.8671 15.7776 20.2505 6.9277 1.3162 13.2323 1.0989 17.3205 17.6776 8.2360 55.3033 0.0360 31.9793 2.4037 4.0337 6.8311 36.9728 47.7860 33.1466 9.9041 8.0613 9.7643 48.6860 27.0568
temp: 298.150 k
press: 1.00000 atm
elementType: 14 6 6 6 6 6 6 6 6 6 6 6 1 1 1 1 1 1 1 1 1 1 1 1 1 1 1 1 1 1
symmnumber: 1
zpe: 668761.5 jmol-1
zpe.correction: 0.254718 hartree
zpe.thermalcorrener: 0.270018 hartree
zpe.thermalcorrenthalpy: 0.270963 hartree
zpe.thermalcorrgfe: 0.210785 hartree
zpe.sumelectzpe: -718.461288 hartree
zpe.sumelectthermal: -718.445988 hartree
zpe.sumelectthermalent: -718.445044 hartree
zpe.sumelectthermalfe: -718.505221 hartree
dipole: 0.5532 -0.0042 0.0564
dipole: 0.5561
quadrupole: -79.8189 -77.8095 -86.0831
quadrupole: 0.0220 -2.2452 0.0555
quadrupole: 1.4182 3.4277 -4.8459 0.0220 -2.2452 0.0555
hfenergy: -718.7160061 hartree
pointgroup: C01 [X(C11H18Si1)]
dipole: -0.2176202 0.0021075 0.0222843 debye
polarizability: 181.2253227|-0.4295407|138.3525016|9.5095541|0.515307|102.0015574 unknown
InChI: InChI=1S/C11H18Si/c1-12(2,3)10-9-11-7-5-4-6-8-11/h4-8H,9-10H2,1-3H3
charge 0 multiplicity 1
30 atoms
Si -3.051233 0.010059 0.123274
C  -1.16274 0.018778 0.511572
C  -0.238302 -0.007235 -0.744317
C  -3.498298 1.530444 -0.957592
C  -3.513204 -1.596712 -0.816715
C  -4.023478 0.092491 1.773305
C  1.240241 -0.008688 -0.376475
C  1.937969 1.209144 -0.164756
C  1.944146 -1.227478 -0.194354
C  3.296942 1.2111 0.222795
C  3.303393 -1.231868 0.193231
C  3.985512 -0.011086 0.404795
H  -0.926812 -0.852712 1.156035
H  -0.92778 0.916604 1.119295
H  -0.464478 0.872961 -1.377793
H  -0.472524 -0.905776 -1.348366
H  -3.22221 2.474038 -0.450788
H  -2.977303 1.502958 -1.93268
H  -4.585218 1.562103 -1.159722
H  -4.599327 -1.633335 -1.02212
H  -2.986484 -1.664123 -1.786776
H  -3.251704 -2.493344 -0.224314
H  -3.787496 -0.77299 2.420088
H  -3.774904 1.012335 2.334626
H  -5.114467 0.091342 1.591573
H  1.411929 2.161749 -0.308419
H  1.422921 -2.178932 -0.361084
H  3.819478 2.162216 0.378161
H  3.830735 -2.183835 0.325341
H  5.040096 -0.011906 0.702879
