program: Gaussian 09
title: 000285882
version: EM64L-G09RevD.01
frameworkgroup: C1[X(C18H22)]
method: RPBEPBE
basis: SDD
operation: Freq
keyword: #p
keyword: freq=noraman
keyword: PBEPBE/SDD
title: #p freq=noraman PBEPBE/SDD
converged: YES YES NO NO
title: Mulliken charges:
elementType: C C C C C C C C C C C C C C C C C C H H H H H H H H H H H H H H H H H H H H H H
charge: -0.593914 -0.593798 0.545002 0.544028 -0.574763 -0.578482 -0.587778 -0.590262 0.464903 0.464668 0.465679 0.465848 -0.588014 -0.581030 -0.819972 -0.820027 -0.819573 -0.819991 0.220928 0.221248 0.220774 0.221171 0.236219 0.236347 0.236807 0.236893 0.234086 0.234273 0.222634 0.223899 0.233160 0.222648 0.223733 0.233257 0.223706 0.222950 0.233001 0.233678 0.222912 0.223148
chargesum: 0.00000
title: Mulliken charges with hydrogens summed into heavy atoms:
elementType: C C C C C C C C C C C C C C C C C C
charge: -0.151738 -0.151853 0.545002 0.544028 -0.338544 -0.342134 -0.350971 -0.353369 0.464903 0.464668 0.465679 0.465848 -0.353928 -0.346757 -0.140278 -0.140389 -0.139915 -0.140252
polarizability: 2.63267973e+02 8.62373806e-02 2.18220876e+02 -1.54345621e+01 5.29490717e-01 1.09855153e+02
1716.lowfreq: -39.9432 -27.8519 -8.3709 -0.0008 -0.0007 0.0004 5.6169 11.7842 12.5861
frequency: -39.4928 -27.7397 12.3878 22.7404 33.7761 38.3916 41.8080 48.1215 95.6917 183.5525 193.0467 215.9080 216.7685 219.4532 246.8059 263.5405 277.7818 287.5124 289.9338 440.1782 457.9277 505.1966 506.5860 509.2873 509.6712 519.9369 523.3196 543.1096 569.8650 586.1745 668.8393 712.7405 730.3736 790.2402 859.2063 864.9534 897.0293 898.8191 899.3338 907.7847 926.3739 928.9064 943.8190 944.8534 989.3717 989.8160 998.8435 1015.2522 1015.7776 1016.8411 1021.8753 1026.5772 1045.0704 1046.2025 1049.0898 1049.4736 1136.7407 1173.8432 1174.2527 1177.2082 1178.6793 1265.8769 1269.1898 1295.8293 1299.1736 1308.3277 1321.9084 1331.1871 1375.6954 1376.9471 1395.1263 1395.3970 1396.1890 1396.4709 1431.7156 1432.0306 1447.1862 1447.7788 1471.4669 1472.5259 1473.0257 1473.2984 1473.4941 1479.7794 1480.4200 1485.8149 1486.1203 1488.3372 1611.2599 1612.3264 1614.1375 1614.3807 2972.1246 2972.2434 2972.7580 2973.2809 2984.4568 2993.0106 3032.1789 3052.9316 3053.0781 3053.1882 3053.3896 3058.9991 3080.8008 3081.5439 3081.6921 3082.2979 3102.8742 3103.6046 3105.7123 3106.0453 3112.2201 3112.5292
redmass: 1.0287 1.0222 3.3686 3.2932 1.0330 1.0905 2.6394 4.0137 4.7019 3.4730 3.0414 3.0751 3.0600 3.4048 1.9727 2.5175 2.8345 2.8838 3.4631 2.3822 2.4130 4.5564 4.6250 5.0730 4.6387 3.1710 3.2287 4.3194 4.5511 3.6648 3.3679 2.0969 2.3768 1.1975 1.5400 1.4226 1.4186 1.3167 1.3566 1.4160 2.7430 2.5289 2.7456 2.4004 6.1891 6.2310 3.4328 1.6042 1.5052 1.7480 1.7087 2.0637 1.5392 1.5439 1.5907 1.5944 1.1861 1.4256 1.4241 1.4076 1.3945 1.2909 1.2305 1.2304 1.1968 2.2202 6.6709 2.1537 6.7306 6.7867 1.2261 1.2316 1.2478 1.2470 2.1092 2.0986 2.3074 2.2196 1.0531 1.0553 1.0770 1.0628 1.0861 1.2272 1.2293 1.3073 1.2973 1.1019 6.0264 5.9621 6.0119 5.9965 1.0383 1.0384 1.0382 1.0382 1.0590 1.0598 1.1012 1.0954 1.0951 1.0953 1.0956 1.1049 1.0997 1.0997 1.0995 1.0993 1.0909 1.0910 1.0911 1.0911 1.0921 1.0920
irintensity: 0.3417 0.3821 0.0166 0.0349 0.6275 0.3418 0.0968 0.6799 0.0009 0.0058 10.4634 0.0161 0.0342 0.0050 0.0110 1.3062 0.0944 1.6619 3.8362 0.0043 0.1372 0.3140 0.5167 2.0866 1.5869 0.3046 0.2107 0.0087 0.3371 0.5878 0.0452 36.0211 0.0354 0.2010 0.6283 51.2614 0.0210 0.0783 0.1156 5.3787 0.1720 2.4404 3.1633 0.8139 0.1889 0.1631 0.0246 2.0007 4.8722 6.6494 0.0459 0.2536 4.6568 2.3352 18.0814 37.7355 0.8260 0.4741 1.0187 0.2608 0.7107 8.1452 0.2381 0.5681 0.0302 0.1059 0.4379 0.0558 0.0683 0.5598 14.0244 19.2292 7.4616 5.3915 0.0111 0.5418 2.0761 0.0679 8.2119 21.2174 1.3819 14.3673 6.3471 15.4109 7.0020 59.9415 6.7192 9.5041 84.2773 0.0859 57.0714 12.2298 32.8652 70.9422 28.6819 26.7365 0.0157 63.3765 0.0098 5.9831 7.8860 37.6241 42.8811 23.9045 15.0759 13.0100 21.4880 20.7699 2.1366 49.8833 57.0964 2.3415 8.9499 6.0432
temp: 298.150 k
press: 1.00000 atm
elementType: 6 6 6 6 6 6 6 6 6 6 6 6 6 6 6 6 6 6 1 1 1 1 1 1 1 1 1 1 1 1 1 1 1 1 1 1 1 1 1 1
symmnumber: 1
zpe: 897199.5 jmol-1
zpe.correction: 0.341725 hartree
zpe.thermalcorrener: 0.359591 hartree
zpe.thermalcorrenthalpy: 0.360535 hartree
zpe.thermalcorrgfe: 0.291867 hartree
zpe.sumelectzpe: -697.822010 hartree
zpe.sumelectthermal: -697.804145 hartree
zpe.sumelectthermalent: -697.803201 hartree
zpe.sumelectthermalfe: -697.871868 hartree
dipole: 0.0404 -0.0173 0.1181
dipole: 0.1260
quadrupole: -97.7938 -97.5022 -114.8072
quadrupole: 0.0316 -2.8644 0.1942
quadrupole: 5.5739 5.8655 -11.4394 0.0316 -2.8644 0.1942
hfenergy: -698.1637354 hartree
pointgroup: C01 [X(C18H22)]
dipole: 0.0162465 -0.0067969 0.0463229 debye
polarizability: 263.0136253|0.1071296|218.2209527|-16.6486171|0.5222437|110.1094239 unknown
InChI: InChI=1S/C18H22/c1-13-7-14(2)10-17(9-13)5-6-18-11-15(3)8-16(4)12-18/h7-12H,5-6H2,1-4H3
charge 0 multiplicity 1
40 atoms
C  -0.416134 -0.022749 -0.665234
C  0.414167 -0.017737 0.661281
C  -1.915187 -0.01326 -0.407703
C  1.913242 -0.009294 0.403814
C  -2.628081 -1.225482 -0.237354
C  2.627019 -1.222514 0.244243
C  -2.619637 1.211248 -0.29203
C  2.614817 1.214768 0.267362
C  -4.01757 -1.232039 0.04176
C  4.014119 -1.23036 -0.046322
C  -4.006524 1.241055 -0.005821
C  4.001027 1.243046 -0.02202
C  -4.690462 0.009706 0.156501
C  4.684003 0.010893 -0.182051
C  -4.774039 -2.54276 0.185149
C  4.770593 -2.541166 -0.188676
C  -4.741365 2.562984 0.145579
C  4.745896 2.563237 -0.135526
H  -0.128999 -0.9164 -1.251843
H  -0.121958 0.861531 -1.26231
H  0.127987 -0.90756 1.254167
H  0.119233 0.870411 1.252256
H  -2.093359 -2.180592 -0.331674
H  2.09331 -2.177123 0.34847
H  -2.078033 2.156856 -0.430907
H  2.070983 2.161346 0.389838
H  -5.767165 0.018482 0.37217
H  5.757211 0.018521 -0.414734
H  -5.730828 -2.401624 0.717628
H  -4.182274 -3.293264 0.740002
H  -5.007818 -2.979233 -0.80557
H  5.699486 -2.41075 -0.771169
H  4.157501 -3.310886 -0.691223
H  5.056113 -2.946416 0.80183
H  -4.313446 3.341446 -0.511038
H  -5.813534 2.461327 -0.098808
H  -4.675563 2.938972 1.185499
H  5.132019 2.888817 0.850359
H  5.612053 2.482149 -0.815959
H  4.089596 3.36811 -0.511735
