program: Gaussian 09
title: 000285901
version: EM64L-G09RevD.01
frameworkgroup: C1[X(C16H18O3)]
method: RPBEPBE
basis: SDD
operation: Freq
keyword: #pfreq=noraman
keyword: PBEPBE/SDD
title: #p freq=noraman PBEPBE/SDD
converged: YES YES NO NO
title: Mulliken charges:
elementType: O O O C C C C C C C C C C C C C C C C H H H H H H H H H H H H H H H H H H
charge: -0.275731 -0.182765 -0.153424 0.127177 -0.524427 -0.476118 -0.410445 0.170228 0.347989 -0.412840 -0.517863 -0.533285 0.001034 -0.407392 0.176234 0.338146 -0.269940 -0.421243 -0.787146 0.233507 0.211715 0.221066 0.263033 0.210613 0.220669 0.216051 0.223990 0.241493 0.237816 0.247133 0.256094 0.250038 0.228107 0.240573 0.239944 0.215998 0.253970
chargesum: 0.00000
title: Mulliken charges with hydrogens summed into heavy atoms:
elementType: O O O C C C C C C C C C C C C C C C C
charge: -0.275731 -0.182765 -0.153424 0.127177 -0.079205 0.007980 0.020838 0.170228 0.347989 0.027201 -0.038555 -0.030058 0.001034 -0.157354 0.176234 0.338146 -0.041833 -0.180670 -0.077233
polarizability: 1.83867019e+02 -4.07922451e+00 1.96497049e+02 -1.22405245e+01 -7.58218553e+00 1.34412574e+02
1716.lowfreq: -0.0005 -0.0001 0.0005 7.4952 9.9465 13.5318 61.9751 67.9935 88.9796
frequency: 61.9075 67.9140 88.9741 95.5488 109.5117 136.2929 140.9134 156.1568 222.0950 238.3843 251.6739 284.4614 291.3285 309.2212 346.4139 359.1577 377.5278 408.3395 423.7429 430.9359 483.2603 495.9005 519.6517 539.5576 553.1943 571.9706 597.9200 633.9373 666.8558 697.9678 735.9048 748.2283 762.0768 790.0707 799.4989 821.3780 845.6125 860.0053 887.4056 904.0209 907.8794 938.6508 946.4016 974.0657 978.2331 999.5174 1024.8065 1043.9684 1046.3443 1067.2237 1084.2894 1090.0215 1101.6721 1115.9591 1122.7777 1132.1170 1162.8679 1183.0835 1203.8468 1221.4949 1236.5235 1240.9276 1260.6848 1267.9519 1280.3295 1298.8752 1323.5728 1332.5360 1337.4488 1349.6035 1354.2039 1370.2076 1403.3169 1418.4400 1444.4311 1455.3591 1456.4153 1457.3721 1458.9506 1469.6230 1473.3645 1478.8762 1485.5893 1589.9766 1603.1438 1625.8886 1707.3978 2976.4772 2986.8519 2988.3391 2996.6219 2997.0927 3004.7804 3008.6374 3028.6575 3044.6135 3060.5272 3065.6348 3068.3378 3092.2040 3093.4483 3096.7942 3128.6488 3146.6912 3166.5245
redmass: 4.1970 4.7452 1.4596 2.5015 5.3324 5.1007 3.3216 3.5982 2.6846 3.3309 3.0260 3.5234 3.7124 3.4364 3.4158 2.4784 4.0212 4.6672 3.8102 4.0385 2.3645 2.3451 4.0869 4.7541 4.2064 3.7526 3.8493 5.6272 4.0189 2.9593 3.4877 2.7724 3.4414 1.5421 2.3427 1.8435 3.1542 4.8153 2.6910 1.4464 1.7401 1.8598 2.3719 1.3411 2.8383 1.7607 1.9439 2.1112 1.6652 2.0633 2.4923 1.9431 3.3934 2.6083 2.5257 1.3988 2.7184 1.3022 1.4544 1.5491 1.5115 1.3808 1.3980 2.0351 1.7505 1.3021 1.3299 1.3953 1.4282 1.3981 1.3619 7.9294 1.2439 2.5689 1.1011 1.1007 1.1121 1.0508 2.0534 1.0847 1.0856 1.2047 1.1546 5.6000 8.1097 9.5074 11.4631 1.0601 1.0605 1.0370 1.0626 1.0615 1.0644 1.0617 1.1003 1.1001 1.1017 1.1002 1.0965 1.1026 1.0988 1.1005 1.0866 1.0919 1.0973
irintensity: 1.9264 1.1648 0.7960 0.2132 2.3550 0.7883 4.1282 2.1491 0.6878 1.2685 1.5194 0.7486 4.6348 3.4082 1.1921 1.0372 11.0204 1.3606 0.5278 0.8553 0.3265 5.4706 1.2595 10.5327 0.3228 5.9436 0.4443 0.6010 13.8674 0.3919 24.9162 2.4652 16.1430 40.5933 18.2053 17.7297 6.1679 31.3011 54.5701 2.0338 1.0789 3.2822 22.1836 0.7409 44.2359 10.6026 1.6933 63.3479 12.5567 12.6981 134.9217 36.5960 13.9783 8.2754 40.3846 9.3574 19.0885 2.7541 14.4910 16.0570 17.5803 5.5937 8.6342 3.7757 12.8233 14.9060 1.1954 1.0784 2.6266 0.3398 3.9135 2.1083 15.0991 31.5633 6.3955 25.0216 6.2444 18.1471 14.5776 9.3422 18.0842 39.4317 8.5128 1.2806 4.0759 109.5237 321.1441 18.9331 34.3273 20.8522 21.3098 47.5398 16.2418 10.8561 22.0326 32.2428 54.8793 7.9875 12.9919 20.2709 16.8979 19.5554 4.2999 20.7672 19.6145
temp: 298.150 k
press: 1.00000 atm
elementType: 8 8 8 6 6 6 6 6 6 6 6 6 6 6 6 6 6 6 6 1 1 1 1 1 1 1 1 1 1 1 1 1 1 1 1 1 1
symmnumber: 1
zpe: 796665.3 jmol-1
zpe.correction: 0.303434 hartree
zpe.thermalcorrener: 0.320105 hartree
zpe.thermalcorrenthalpy: 0.321049 hartree
zpe.thermalcorrgfe: 0.260319 hartree
zpe.sumelectzpe: -844.781887 hartree
zpe.sumelectthermal: -844.765217 hartree
zpe.sumelectthermalent: -844.764273 hartree
zpe.sumelectthermalfe: -844.825002 hartree
dipole: -0.8487 -6.0683 2.7076
dipole: 6.6989
quadrupole: -102.4392 -125.8528 -107.9705
quadrupole: -0.9220 -0.6230 7.0267
quadrupole: 9.6483 -13.7653 4.1170 -0.9220 -0.6230 7.0267
hfenergy: -845.0853213 hartree
pointgroup: C01 [X(C16H18O3)]
dipole: -0.2403042 2.3885548 -1.0877846 debye
polarizability: 183.3230653|4.7170744|196.1793051|13.4722505|-8.1403876|135.2742713 unknown
InChI: InChI=1S/C16H18O3/c1-11-5-4-6-12-15(11)19-14(18)8-10-16(12)9-3-2-7-13(16)17/h4-6H,2-3,7-10H2,1H3
charge 0 multiplicity 1
37 atoms
O  1.206532 -1.143231 0.718236
O  -1.842485 -2.025018 0.698746
O  1.161157 -3.391297 0.263622
C  -1.10655 -0.123932 -0.698259
C  -2.361342 0.687096 -1.191659
C  -0.773802 -1.227176 -1.747888
C  -2.945999 1.666948 -0.143378
C  -1.614751 -0.790031 0.627282
C  0.129525 0.758129 -0.449718
C  -3.272563 0.963068 1.193958
C  -2.032645 0.175579 1.722844
C  0.638725 -1.864765 -1.610024
C  1.247418 0.199875 0.22512
C  0.254559 2.093405 -0.907566
C  1.00268 -2.250344 -0.185103
C  2.428401 0.927222 0.518583
C  1.425351 2.840737 -0.655585
C  2.495275 2.266951 0.065678
C  3.566907 0.276613 1.277061
H  -3.140104 -0.053796 -1.463403
H  -2.105266 1.222043 -2.126912
H  -0.849152 -0.79231 -2.762842
H  -1.535158 -2.021788 -1.652924
H  -3.861816 2.132011 -0.556437
H  -2.231226 2.488016 0.050598
H  -4.112925 0.254251 1.056852
H  -3.590113 1.702854 1.952007
H  -2.281042 -0.393718 2.633758
H  -1.216546 0.886666 1.94859
H  1.399987 -1.155218 -1.987171
H  0.69118 -2.781253 -2.219597
H  -0.564006 2.559316 -1.463674
H  1.500124 3.872539 -1.015371
H  3.396807 2.854324 0.274117
H  3.962199 -0.601691 0.734589
H  4.39345 0.989702 1.434726
H  3.228011 -0.097779 2.259349
