program: Gaussian 09
title: 000285920
version: EM64L-G09RevD.01
frameworkgroup: C1[X(C22H22Br2O2)]
method: RPBEPBE
basis: SDD
operation: Freq
keyword: #p
keyword: freq=noraman
keyword: PBEPBE/SDD
title: #p freq=noraman PBEPBE/SDD
converged: YES YES NO NO
title: Mulliken charges:
elementType: Br Br O O C C C C C C C C C C C C C C C C C C C C C C H H H H H H H H H H H H H H H H H H H H H H
charge: -0.031867 -0.031919 -0.233575 -0.233246 -0.198963 -0.199828 -0.454737 -0.454960 -0.472066 -0.471990 0.090262 0.090024 0.315911 0.316064 -0.343615 -0.344671 -0.353797 -0.354230 -0.406466 -0.407675 -0.389515 -0.388381 0.437794 0.437611 -0.805534 -0.805506 0.272165 0.272592 0.277993 0.261041 0.278042 0.260968 0.337315 0.337281 0.251402 0.252468 0.273519 0.273567 0.237568 0.237656 0.234973 0.234995 0.230570 0.228349 0.241690 0.228416 0.230905 0.241401
chargesum: 0.00000
title: Mulliken charges with hydrogens summed into heavy atoms:
elementType: Br Br O O C C C C C C C C C C C C C C C C C C C C C C
charge: -0.031867 -0.031919 -0.233575 -0.233246 0.073202 0.072764 0.084297 0.084049 -0.134751 -0.134709 0.090262 0.090024 0.315911 0.316064 -0.092213 -0.092203 -0.080278 -0.080664 -0.168899 -0.170019 -0.154542 -0.153385 0.437794 0.437611 -0.104924 -0.104784
polarizability: 3.09634984e+02 -3.01616233e-01 2.92844750e+02 3.98417336e-01 4.67330956e+01 2.39618518e+02
1716.lowfreq: -6.3785 -3.2961 -0.0006 0.0003 0.0005 5.0814 9.4960 22.5713 23.5479
frequency: 9.3923 22.4350 23.4226 34.9356 40.3364 42.3880 44.6805 45.2936 68.8273 89.6714 95.3853 103.2309 109.2197 129.1829 140.4149 173.6481 217.1765 221.8645 235.4895 244.7488 256.8615 287.9154 293.2218 327.4441 341.7951 344.4088 357.7256 394.9133 402.7124 404.1163 434.8988 481.0147 482.7857 489.0773 489.9171 520.8055 587.2022 597.7336 614.4354 633.4653 633.4965 674.4190 685.4558 694.6833 739.8348 741.2918 769.8668 790.1227 797.0944 819.6084 836.5009 838.6963 855.9984 857.0401 859.3582 884.5370 937.9659 945.2623 971.3096 973.6917 983.4704 987.7888 993.0374 994.1648 996.1880 1008.7823 1009.7766 1028.4784 1028.5237 1046.5707 1046.7190 1050.7085 1082.4227 1127.0238 1127.6514 1144.7250 1149.3110 1167.9441 1175.5860 1195.9022 1198.3975 1213.2365 1218.0099 1225.1209 1230.4419 1240.3211 1271.4202 1292.3693 1298.7148 1306.6686 1309.2859 1320.3779 1338.9406 1342.7875 1350.6589 1355.1804 1373.0145 1373.8621 1396.7246 1396.9619 1414.1168 1414.2211 1447.9461 1450.3911 1467.8644 1467.9521 1471.9461 1472.6914 1502.7269 1502.9376 1545.1846 1546.2389 1580.3944 1583.2909 1618.8740 1619.6656 2976.5386 2976.6224 2993.4020 2993.5452 3043.7743 3053.8227 3058.6740 3058.9160 3064.3948 3068.8072 3089.7812 3090.0048 3096.0567 3105.8015 3125.9746 3126.2428 3130.7070 3130.9756 3157.7630 3158.0314 3162.1232 3162.5382
redmass: 5.3738 8.4133 9.9497 1.0997 3.6055 5.2393 1.4230 1.8390 11.4333 7.2031 4.4951 5.3505 12.4902 7.9681 6.0123 16.8728 4.4147 6.0249 4.9187 3.5538 4.6249 5.1586 4.0948 2.6784 3.0400 3.4275 3.8197 4.0749 2.8194 2.8901 4.5185 2.8315 3.3271 3.7000 3.6296 4.5472 5.8001 5.3168 3.9425 6.8872 6.9269 5.2060 4.6445 4.2107 2.9304 2.7712 4.5267 4.9746 2.2765 5.7948 1.6060 1.5985 1.3110 1.3975 2.9517 2.9516 2.7768 2.1072 1.3645 1.4004 1.6874 1.4265 1.4729 1.3861 1.7821 3.2070 3.1253 2.5648 2.5446 1.5983 1.6004 2.5861 2.0561 1.3214 1.3296 1.2056 1.6401 1.1823 1.2043 1.1649 1.1361 1.4921 2.6119 2.6033 2.1450 2.1593 2.5914 1.3854 1.6561 1.4083 1.2618 1.3984 1.3543 1.5502 1.7364 1.4532 4.3574 4.2242 1.2219 1.2209 3.5463 3.5158 1.0742 1.0789 1.1095 1.1094 1.0571 1.0575 2.5561 2.5487 6.8947 7.0216 6.3686 6.3664 6.3376 6.3664 1.0391 1.0392 1.0616 1.0618 1.0827 1.0893 1.0941 1.0941 1.0984 1.0939 1.1001 1.1001 1.0866 1.0897 1.0892 1.0891 1.0892 1.0891 1.0943 1.0943 1.0958 1.0957
irintensity: 0.4919 1.3621 0.2913 0.4399 1.2091 1.8724 0.1271 0.5950 1.3047 1.2257 0.0287 0.0304 3.4153 6.3340 1.7715 1.2924 2.0401 11.3716 0.8339 8.7557 0.9107 0.2336 0.7253 4.8548 0.2813 3.0717 25.2971 1.0794 0.2527 0.3303 0.1094 27.6390 9.1263 46.8025 13.7128 9.2638 8.1897 15.0872 27.4238 0.1779 0.8599 4.7105 3.1246 6.3742 9.1063 23.9532 1.6819 3.2482 21.2513 0.1431 18.2050 43.8187 1.5160 8.4781 3.6788 1.6622 54.7415 46.2002 0.5808 9.6475 2.3018 0.8736 0.0794 4.9092 0.0300 19.9416 2.4644 25.9776 9.3620 25.4644 20.2271 10.9450 2.1957 5.8100 14.9463 0.4667 11.0680 57.5793 18.3448 49.9261 45.2225 40.7378 40.8016 2.5447 15.5712 38.1421 203.8293 57.0028 50.1260 21.4321 0.0651 10.6788 6.5593 57.6331 14.7291 0.1639 9.5191 27.4917 14.1033 15.3660 16.6813 19.0445 35.2022 3.5652 19.7978 14.8778 13.4079 12.5040 1.8688 2.6092 67.6573 208.8597 8.8242 69.0045 53.1632 80.2765 23.9252 24.8685 4.8903 16.6398 0.4286 6.5421 19.4436 20.1781 0.8705 21.6766 14.0861 15.6745 0.8816 9.8598 15.2805 14.7297 15.4699 12.6713 9.6802 11.3160 2.5572 1.4711
temp: 298.150 k
press: 1.00000 atm
elementType: 35 35 8 8 6 6 6 6 6 6 6 6 6 6 6 6 6 6 6 6 6 6 6 6 6 6 1 1 1 1 1 1 1 1 1 1 1 1 1 1 1 1 1 1 1 1 1 1
symmnumber: 1
zpe: 995703.6 jmol-1
zpe.correction: 0.379243 hartree
zpe.thermalcorrener: 0.405056 hartree
zpe.thermalcorrenthalpy: 0.406001 hartree
zpe.thermalcorrgfe: 0.317336 hartree
zpe.sumelectzpe: -1027.062901 hartree
zpe.sumelectthermal: -1027.037088 hartree
zpe.sumelectthermalent: -1027.036144 hartree
zpe.sumelectthermalfe: -1027.124809 hartree
dipole: -4.4860 0.0974 -0.0388
dipole: 4.4872
quadrupole: -154.0570 -156.9476 -175.6425
quadrupole: -0.1346 0.1863 -2.9415
quadrupole: 8.1587 5.2681 -13.4268 -0.1346 0.1863 -2.9415
hfenergy: -1027.4421444 hartree
pointgroup: C01 [X(C22H22Br2O2)]
dipole: 0.0361798 1.764993 -0.0124235 debye
polarizability: 288.3962672|0.2565149|309.6362911|48.9999619|-0.2666672|244.0656936 unknown
InChI: InChI=1S/C22H22Br2O2/c1-13-3-7-15(8-4-13)21(25)17-11-19(23)20(24)12-18(17)22(26)16-9-5-14(2)6-10-16/h3-10,17-20H,11-12H2,1-2H3
charge 0 multiplicity 1
48 atoms
Br -2.063408 -4.602164 -1.178358
Br 2.077322 -4.595002 1.173118
O  -0.359418 -0.425717 2.281497
O  0.357686 -0.422336 -2.282241
C  -0.740317 -1.69078 0.256905
C  0.741975 -1.687152 -0.257932
C  -1.022215 -2.976408 1.078993
C  1.029164 -2.970389 -1.08188
C  -0.680318 -4.268534 0.336714
C  0.692862 -4.265055 -0.34151
C  -0.98219 -0.475541 1.172623
C  0.978126 -0.469519 -1.172017
C  -1.933083 0.607128 0.779691
C  1.92325 0.617329 -0.776469
C  -2.459016 0.746572 -0.534647
C  2.440532 0.762063 0.540679
C  -2.312614 1.556925 1.7702
C  2.300655 1.569292 -1.765741
C  -3.341029 1.80264 -0.838717
C  3.313551 1.824693 0.84838
C  -3.200587 2.600598 1.460822
C  3.179962 2.619088 -1.452804
C  -3.730524 2.745076 0.148619
C  3.707875 2.764178 -0.139753
C  -4.662906 3.891075 -0.194376
C  4.679938 3.880551 0.190407
H  -1.406504 -1.670363 -0.621676
H  1.40851 -1.664691 0.620376
H  -0.408014 -2.943714 2.000988
H  -2.080221 -3.002752 1.394812
H  0.414648 -2.938944 -2.003702
H  2.087187 -2.991784 -1.397995
H  -0.825893 -5.160214 0.964038
H  0.84229 -5.155166 -0.970157
H  -2.163631 0.056711 -1.331511
H  2.139095 0.075729 1.338391
H  -1.895518 1.446194 2.776605
H  1.883248 1.459245 -2.772102
H  -3.731309 1.900768 -1.858544
H  3.691162 1.931218 1.87207
H  -3.492435 3.315942 2.239116
H  3.464873 3.340312 -2.228249
H  -5.376692 3.609793 -0.988158
H  -5.238249 4.225034 0.686517
H  -4.090355 4.764602 -0.563386
H  4.51532 4.765122 -0.449222
H  4.59397 4.194888 1.245122
H  5.725243 3.55046 0.030964
