program: Gaussian 09
title: 000285862
version: EM64L-G09RevD.01
frameworkgroup: C1[X(C16H12N2)]
method: RPBEPBE
basis: SDD
operation: Freq
keyword: #pfreq=noraman
keyword: PBEPBE/SDD
title: #p freq=noraman PBEPBE/SDD
converged: YES YES NO NO
title: Mulliken charges:
elementType: N N C C C C C C C C C C C C C C C C H H H H H H H H H H H H
charge: -0.249662 -0.004515 0.257105 0.203511 0.191042 0.243721 -0.592638 -0.596126 0.477718 0.347067 -0.390821 -0.647345 -0.376153 -0.254037 -0.222515 -0.352645 -0.524924 -0.360367 0.241551 0.243787 0.236979 0.243236 0.239300 0.237877 0.233856 0.226628 0.225234 0.233081 0.251974 0.238078
chargesum: 0.00000
title: Mulliken charges with hydrogens summed into heavy atoms:
elementType: N N C C C C C C C C C C C C C C C C
charge: -0.249662 -0.004515 0.257105 0.203511 0.191042 0.243721 -0.351087 -0.352339 0.477718 0.347067 -0.153842 0.073069 -0.142297 -0.027409 0.002719 -0.119564 -0.272950 -0.122289
polarizability: 3.55070895e+02 6.72658202e+00 1.93122372e+02 -3.21636376e-01 9.67137000e-01 7.50208141e+01
1716.lowfreq: -7.8058 -5.2002 0.0000 0.0002 0.0007 1.5164 41.9121 67.2307 91.8704
frequency: 41.5557 67.2281 91.8695 126.3625 152.3667 170.7146 226.0220 255.5142 313.3054 317.9964 343.0346 346.6525 409.3480 451.5357 469.9168 525.4721 533.2554 569.5815 574.6377 582.0914 600.4080 632.7288 675.3450 720.8547 724.3321 753.9235 765.8799 769.4889 784.7172 814.9705 835.9068 854.1471 875.1752 892.3335 901.4840 936.6610 940.8511 963.0078 963.9473 975.4030 1017.9696 1021.0025 1047.1879 1116.1273 1116.6471 1129.4711 1166.9195 1178.6233 1204.7415 1222.7200 1242.1504 1257.8192 1265.3907 1318.0228 1345.9476 1354.2159 1375.3013 1403.6134 1419.7556 1423.9008 1436.4815 1457.9463 1464.1234 1476.5139 1479.5805 1488.8420 1491.6654 1572.6692 1586.0841 1596.4422 1618.8297 1648.5408 2974.6471 3064.1007 3098.8925 3099.3018 3127.5335 3129.4686 3132.0768 3137.4332 3141.5988 3150.8997 3154.3821 3167.5401
redmass: 1.0760 5.4589 3.7544 3.1917 5.0155 5.5015 4.3497 2.7722 4.0892 4.5091 5.8294 6.0122 3.3772 2.7575 2.9086 7.3450 5.3840 4.0208 5.7598 4.2896 4.8079 6.9034 6.2311 3.4418 5.6863 1.5767 4.8130 3.3119 2.1595 1.4528 4.7731 1.4701 1.6436 1.4284 4.1878 1.4025 1.6483 4.8962 1.4386 1.3173 2.2082 2.3342 4.7055 1.3200 1.6900 1.5852 1.2506 1.5505 1.7645 1.6960 1.8313 3.0224 2.0753 1.8287 2.8903 1.7311 4.8700 5.4266 2.1340 3.1893 1.8563 2.8654 2.1799 1.1506 2.9236 1.2715 2.9288 7.6798 6.5827 7.0612 7.6212 7.8115 1.0389 1.0957 1.1004 1.0908 1.0870 1.0854 1.0916 1.0896 1.0918 1.0949 1.0983 1.1002
irintensity: 0.1074 0.2529 0.0137 3.0426 0.0485 1.9987 1.5484 0.3627 0.0315 0.2115 0.0555 0.2371 1.6068 0.0048 21.2388 0.2769 2.9380 1.2682 8.6449 6.6858 3.6566 8.6635 3.7318 16.9940 1.9846 77.5590 1.7298 5.5293 4.6558 4.1255 22.2787 0.0971 51.1969 29.0481 2.1296 4.8363 9.9293 1.7660 2.3483 0.0101 13.4744 4.2791 2.5838 7.8372 39.9620 12.4017 4.4701 0.9270 6.3245 7.2486 14.9935 75.4358 10.8876 51.9071 5.9309 36.6197 11.5521 12.2504 7.6579 1.6822 11.2879 80.7189 17.0332 49.0401 44.2929 50.3352 45.8367 8.4587 2.5290 1.7277 120.7183 41.6147 71.6647 23.8106 9.3075 19.4548 1.4404 0.2059 10.2801 3.5668 6.0290 28.4200 51.2974 33.8606
temp: 298.150 k
press: 1.00000 atm
elementType: 7 7 6 6 6 6 6 6 6 6 6 6 6 6 6 6 6 6 1 1 1 1 1 1 1 1 1 1 1 1
symmnumber: 1
zpe: 617710.6 jmol-1
zpe.correction: 0.235274 hartree
zpe.thermalcorrener: 0.248686 hartree
zpe.thermalcorrenthalpy: 0.249630 hartree
zpe.thermalcorrgfe: 0.194858 hartree
zpe.sumelectzpe: -725.221492 hartree
zpe.sumelectthermal: -725.208080 hartree
zpe.sumelectthermalent: -725.207136 hartree
zpe.sumelectthermalfe: -725.261907 hartree
dipole: -4.2568 3.3495 0.0314
dipole: 5.4167
quadrupole: -112.2570 -86.1949 -111.1422
quadrupole: 6.3022 -0.0566 0.0106
quadrupole: -9.0590 17.0031 -7.9441 6.3022 -0.0566 0.0106
hfenergy: -725.4567652 hartree
pointgroup: C01 [X(C16H12N2)]
dipole: 1.6628195 -1.3328124 0.0122617 debye
polarizability: 355.1789649|5.2678458|193.0140572|0.2569292|-0.9925298|75.0210598 unknown
InChI: InChI=1S/C16H12N2/c1-18-15-5-3-2-4-13(15)14-8-12-10-17-7-6-11(12)9-16(14)18/h2-10H,1H3
charge 0 multiplicity 1
30 atoms
N  1.385274 -1.547372 -0.024424
N  -4.550112 1.144494 0.001971
C  0.123246 -0.929679 -0.009857
C  0.316009 0.514078 -0.010447
C  1.758588 0.742965 -0.007444
C  2.385437 -0.549854 -0.005709
C  -1.147911 -1.511589 0.00124
C  -0.794312 1.360714 -0.010131
C  -2.286168 -0.648086 0.000825
C  -2.107869 0.797387 -0.006305
C  2.557835 1.907045 -0.004226
C  1.621222 -2.98874 -0.002791
C  3.788173 -0.693174 0.008257
C  3.963833 1.772992 0.003454
C  4.56764 0.48622 0.010764
C  -3.636747 -1.136066 0.009678
C  -3.289305 1.616727 -0.00529
C  -4.702912 -0.237188 0.009556
H  -1.292747 -2.596824 0.017972
H  -0.677201 2.450731 -0.011163
H  2.097066 2.901049 -0.006416
H  1.646417 -3.388688 1.02939
H  0.82547 -3.50788 -0.563518
H  2.581708 -3.217613 -0.49356
H  4.270386 -1.675835 0.024264
H  4.597392 2.666076 0.006939
H  5.660302 0.40483 0.021749
H  -3.828734 -2.214879 0.015912
H  -3.182155 2.710099 -0.010654
H  -5.739822 -0.589834 0.015562
