program: Gaussian 09
title: 000285889
version: EM64L-G09RevD.01
frameworkgroup: C1[X(C14H18O5)]
method: RPBEPBE
basis: SDD
operation: Freq
keyword: #pfreq=noraman
keyword: PBEPBE/SDD
title: #p freq=noraman PBEPBE/SDD
converged: YES YES NO NO
title: Mulliken charges:
elementType: O O O O O C C C C C C C C C C C C C C H H H H H H H H H H H H H H H H H H
charge: -0.458361 -0.246884 -0.240402 -0.262353 -0.231994 -0.104175 0.390243 -0.335664 -0.382114 0.226969 0.276888 0.438250 -0.399166 -0.384607 -0.809206 -0.262919 -0.266206 -0.653134 -0.662379 0.236487 0.278736 0.227266 0.228978 0.375706 0.224952 0.223347 0.235604 0.239355 0.226492 0.232654 0.226692 0.215487 0.254952 0.237337 0.215758 0.251167 0.236242
chargesum: 0.00000
title: Mulliken charges with hydrogens summed into heavy atoms:
elementType: O O O O O C C C C C C C C C C C C C C
charge: -0.082654 -0.246884 -0.240402 -0.262353 -0.231994 -0.104175 0.390243 -0.099177 -0.103378 0.226969 0.276888 0.438250 -0.171900 -0.155629 -0.125303 0.202928 0.193140 0.054643 0.040788
polarizability: 2.04504004e+02 4.83627228e+00 1.44074536e+02 -1.66740742e+00 5.18112648e+00 1.53270045e+02
1716.lowfreq: -10.4261 -6.9414 -3.8362 -0.0006 -0.0004 -0.0001 10.7487 25.0050 33.7708
frequency: 7.9885 24.9936 33.6554 38.9139 43.6444 52.9315 62.5320 87.2741 92.2247 119.6285 134.8884 157.4674 180.0167 202.3035 221.6609 259.2368 282.2073 300.9031 308.5430 317.2175 335.4603 355.7171 384.9191 404.4315 421.0590 428.2262 463.0900 490.1326 520.3439 577.6976 634.5332 645.8230 701.8791 720.7722 730.4597 736.4092 787.6389 795.5139 815.8880 816.9736 827.0631 830.5460 856.0158 939.8136 950.6182 965.8294 982.6604 986.4319 997.3742 1015.7373 1017.2500 1028.1364 1046.5372 1096.1093 1097.2106 1125.7763 1155.0172 1158.1719 1162.1753 1190.4773 1199.7027 1213.6041 1222.5408 1273.9236 1274.9459 1306.7219 1349.6616 1352.1691 1361.0432 1373.7789 1393.5816 1395.8832 1396.0045 1403.6600 1456.6735 1458.4922 1461.2386 1462.1310 1471.5644 1472.8256 1481.8513 1484.3637 1503.7052 1584.9290 1611.1605 1614.1955 1625.0049 2973.7411 2995.3394 2998.4427 3030.1678 3035.5984 3054.7807 3083.4783 3090.9084 3094.5902 3097.9503 3101.7379 3119.4463 3123.3034 3123.6354 3127.2618 3153.3469 3174.7883 3391.5196
redmass: 1.0182 3.9249 3.9483 3.3093 3.2466 4.1890 3.2687 6.7211 4.0655 3.6860 3.1519 4.2532 1.6221 1.3455 2.4046 3.8965 3.1947 3.8375 5.6142 3.7759 3.7602 4.3427 4.6321 2.8492 4.1024 3.4286 1.3544 3.6112 3.0538 5.4829 6.9100 6.6773 4.0145 10.2477 3.3351 3.0863 2.7119 3.1083 1.8328 1.4187 1.6537 2.5765 1.2575 4.5896 2.0472 1.9241 1.5823 1.3979 2.4691 3.0411 3.0616 5.6897 1.5671 2.1880 2.1616 1.3080 1.8780 1.6704 2.7015 1.3103 4.8648 3.9565 2.8975 1.1373 1.1274 1.2843 1.2772 1.2905 1.7753 3.5441 1.2273 1.2258 1.2253 3.3085 1.1016 1.0768 1.0648 1.0423 1.0930 1.0541 1.0560 1.0523 2.6299 6.4630 8.9355 8.9079 6.6057 1.0385 1.0364 1.0366 1.0601 1.0598 1.0950 1.0997 1.0974 1.0974 1.1028 1.1033 1.0887 1.1055 1.0902 1.1062 1.0952 1.0935 1.0647
irintensity: 0.4528 0.1496 1.2428 1.9177 0.7895 0.4252 1.5146 0.1256 0.8442 0.2128 0.3931 0.5269 0.4972 3.8687 0.5698 3.1953 5.4272 12.0256 9.0283 16.8310 2.0887 35.5870 3.1906 0.8191 2.5545 3.6514 49.4054 11.9612 43.2737 4.7400 3.7995 16.5938 8.8744 10.0788 20.1302 14.5878 0.1658 1.0355 20.6542 12.5879 18.4359 13.4517 5.8101 24.3765 10.5970 3.7077 3.4704 3.2351 31.2126 67.2717 44.2182 109.7191 17.4617 34.6602 16.6433 1.5584 68.7409 8.7527 329.6020 83.9521 122.3523 95.0297 2.1787 11.6349 5.2955 0.0487 4.5284 1.7882 44.9038 17.4048 26.7573 23.4576 14.4308 4.6432 17.3272 16.7800 8.1873 15.8566 15.4855 12.6365 19.2119 13.3122 38.8903 4.0465 181.8558 111.3609 43.6257 38.9390 18.6811 15.9700 26.0343 25.0476 23.6939 18.1631 30.4627 30.5864 1.2601 1.1634 17.3976 22.1577 28.0750 23.7167 10.8116 2.9845 90.7197
temp: 298.150 k
press: 1.00000 atm
elementType: 8 8 8 8 8 6 6 6 6 6 6 6 6 6 6 6 6 6 6 1 1 1 1 1 1 1 1 1 1 1 1 1 1 1 1 1 1
symmnumber: 1
zpe: 772186.7 jmol-1
zpe.correction: 0.294110 hartree
zpe.thermalcorrener: 0.315052 hartree
zpe.thermalcorrenthalpy: 0.315996 hartree
zpe.thermalcorrgfe: 0.240203 hartree
zpe.sumelectzpe: -918.969454 hartree
zpe.sumelectthermal: -918.948512 hartree
zpe.sumelectthermalent: -918.947568 hartree
zpe.sumelectthermalfe: -919.023361 hartree
dipole: 0.6701 -0.5302 -2.9098
dipole: 3.0327
quadrupole: -105.5046 -97.5347 -108.7799
quadrupole: 1.6233 3.2884 1.5495
quadrupole: -1.5649 6.4050 -4.8401 1.6233 3.2884 1.5495
hfenergy: -919.2635642 hartree
pointgroup: C01 [X(C14H18O5)]
dipole: -0.0989091 -0.3541303 1.1350976 debye
polarizability: 203.6517416|-0.793206|144.9774753|-8.0932999|-6.1708036|153.2193674 unknown
InChI: InChI=1S/C14H18O5/c1-4-18-12(15)14(17,13(16)19-5-2)11-8-6-10(3)7-9-11/h6-9,17H,4-5H2,1-3H3
charge 0 multiplicity 1
37 atoms
O  0.367326 0.926057 -1.814578
O  1.539205 -1.648655 0.507519
O  0.487607 2.241264 0.956127
O  1.721005 -1.360794 -1.798024
O  2.543019 1.264507 0.447038
C  0.459755 0.299582 -0.496111
C  -0.940609 -0.017252 0.047786
C  -1.126049 -0.473934 1.375623
C  -2.067174 0.135308 -0.79015
C  1.310927 -0.993948 -0.668054
C  1.292058 1.290577 0.36824
C  -3.560467 -0.628309 1.017002
C  -2.418976 -0.775651 1.848566
C  -3.359136 -0.17153 -0.309376
C  -4.954362 -0.924468 1.543352
C  2.430916 -2.859482 0.452417
C  1.184519 3.365047 1.664788
C  3.899178 -2.435021 0.507169
C  1.569294 4.463324 0.671268
H  -0.26234 -0.604616 2.036118
H  -1.916963 0.504353 -1.808175
H  -2.547293 -1.130198 2.878795
H  -4.223198 -0.049502 -0.97424
H  0.934878 0.375924 -2.430028
H  -5.632038 -1.251261 0.735015
H  -4.937107 -1.71369 2.315831
H  -5.404238 -0.023561 2.004696
H  2.195888 -3.418018 -0.470206
H  2.12377 -3.436366 1.338536
H  2.069718 2.95575 2.182875
H  0.434317 3.706187 2.395278
H  4.539471 -3.334901 0.562105
H  4.179004 -1.863658 -0.392875
H  4.095114 -1.810518 1.394729
H  1.995494 5.324903 1.218125
H  2.325484 4.099814 -0.044225
H  0.685502 4.810539 0.109744
