program: Gaussian 09
title: 000285848
version: EM64L-G09RevD.01
frameworkgroup: C1[X(C9H10BrN)]
method: RPBEPBE
basis: SDD
operation: Freq
keyword: #p
keyword: freq=noraman
keyword: PBEPBE/SDD
title: #p freq=noraman PBEPBE/SDD
converged: YES YES NO NO
title: Mulliken charges:
elementType: Br N C C C C C C C C C H H H H H H H H H H
charge: -0.004294 -0.086135 -0.511175 -0.511250 0.262304 0.262704 -0.629005 -0.362275 -0.397787 -0.196093 -0.180498 0.223202 0.245420 0.243961 0.221848 0.229005 0.205406 0.228969 0.260900 0.245567 0.249228
chargesum: 0.00000
title: Mulliken charges with hydrogens summed into heavy atoms:
elementType: Br N C C C C C C C C C
charge: -0.004294 -0.086135 -0.042553 -0.045441 0.262304 0.262704 0.034374 -0.101375 -0.152220 -0.196093 0.068730
polarizability: 1.70065033e+02 4.72652200e+00 1.09902416e+02 -4.10663559e+00 4.65782839e+00 6.44579045e+01
1716.lowfreq: -0.0002 -0.0002 0.0004 4.0285 7.7064 11.3000 58.6949 105.1517 163.4966
frequency: 58.5972 105.1455 163.4964 181.8480 216.7974 259.9712 270.2678 356.9842 360.3951 416.2323 444.1446 518.9137 531.3524 628.6241 664.0000 695.3715 765.1007 806.6877 832.0282 844.0284 877.9170 943.3264 968.4789 982.4293 987.3113 1053.8980 1068.4256 1099.3092 1117.5437 1137.8506 1162.2520 1205.3587 1212.2637 1246.7621 1260.5886 1285.8660 1298.0051 1375.8249 1399.1273 1426.0051 1453.2281 1456.1994 1467.7304 1472.1835 1476.2801 1584.0596 1604.5127 2883.0944 2966.3187 2967.5312 3033.5305 3051.8814 3056.3691 3087.3096 3134.2515 3155.5394 3169.6024
redmass: 3.5630 3.5637 5.2371 3.0332 1.0947 9.9463 4.4916 1.9395 2.8345 2.8624 2.6549 4.3254 4.4872 6.1797 6.1367 3.4762 3.9303 1.6170 2.6340 5.4677 1.4303 1.4614 1.8390 2.1824 2.2216 2.2383 1.7454 2.6192 1.3741 1.3308 1.7204 2.9596 1.5615 1.2881 1.3188 1.2844 1.8971 5.6773 3.8293 1.1812 2.2709 1.0859 1.1452 1.0524 1.0485 7.8927 7.5095 1.0532 1.0668 1.0675 1.0768 1.0960 1.0969 1.1009 1.0899 1.0928 1.0956
irintensity: 0.6046 0.9391 1.0503 1.1927 0.1655 4.3013 1.9157 13.0845 1.0124 6.8044 0.6895 4.1609 15.6012 19.4072 11.7332 5.4765 12.6269 32.1987 6.0475 36.9543 7.8510 6.6226 20.8665 1.4005 12.4248 26.1674 12.2397 12.5622 7.4757 2.2699 13.7247 7.8938 0.3714 3.5370 2.0301 1.2886 7.2533 2.3717 25.3500 2.9806 48.3031 13.1470 7.0341 18.0834 3.8593 11.8056 13.5644 94.8906 45.2723 37.6393 51.1614 12.7898 24.0519 29.0640 9.6023 2.9697 6.2782
temp: 298.150 k
press: 1.00000 atm
elementType: 35 7 6 6 6 6 6 6 6 6 6 1 1 1 1 1 1 1 1 1 1
symmnumber: 1
zpe: 438121.2 jmol-1
zpe.correction: 0.166872 hartree
zpe.thermalcorrener: 0.176801 hartree
zpe.thermalcorrenthalpy: 0.177746 hartree
zpe.thermalcorrgfe: 0.130372 hartree
zpe.sumelectzpe: -416.342972 hartree
zpe.sumelectthermal: -416.333042 hartree
zpe.sumelectthermalent: -416.332098 hartree
zpe.sumelectthermalfe: -416.379472 hartree
dipole: 1.7473 0.5637 0.5682
dipole: 1.9219
quadrupole: -80.0512 -66.2674 -76.6084
quadrupole: 0.9932 3.4612 0.6976
quadrupole: -5.7422 8.0416 -2.2994 0.9932 3.4612 0.6976
hfenergy: -416.5098434 hartree
pointgroup: C01 [X(C9H10Br1N1)]
dipole: 0.6709058 -0.3278173 -0.1190598 debye
dipolederiv: -0.7023508 0.2041585 -0.1361367 0.2469515 -0.1602391 0.0517159 -0.1586428 0.0472184 -0.0841409 -0.7411313 -0.0309128 0.0639914 -0.0288241 -0.3612057 0.0160858 -0.1486541 -0.0154041 -0.4724588 0.3671708 -0.0289633 -0.0207104 -0.0799087 0.2118757 0.099174 0.0087843 0.0252963 0.2577718 0.2824629 0.0201757 0.0051522 0.1213917 0.2760265 -0.0965075 0.0133357 -0.0325276 0.2585982 -0.0144785 0.11628 0.0426449 0.1212285 0.0203016 0.0077813 0.0584168 0.0540335 -0.0548638 0.0489218 -0.0898615 0.0374351 -0.2166574 -0.1502318 -0.0228048 0.0740158 -0.0347903 -0.0639673 0.3284283 0.029505 -0.0577724 0.0395006 0.1035205 -0.0136865 -0.1264303 -0.0137844 0.4141028 -0.3743513 -0.013506 -0.0586284 0.0814301 0.0166919 0.035761 -0.0805468 0.0113782 -0.1210131 -0.009009 -0.0121885 0.0444939 0.0688658 0.1252723 0.0234026 0.0320804 0.0015496 -0.1378931 1.1171733 -0.3704593 0.2843173 -0.4789997 0.207518 -0.0956136 0.2929901 -0.0821682 -0.0524199 -0.3201524 0.1687346 -0.0317304 0.139638 -0.1004165 0.0395917 -0.0599146 0.046489 -0.1134422 0.0154263 -0.0373332 0.0097767 -0.0482436 -0.0719085 0.0602539 0.0474369 0.1272588 0.0436359 -0.0471269 -0.0079022 0.0102973 0.0139767 0.045153 -0.0632969 0.0103905 -0.1160428 -0.131308 -0.0380472 -0.0027323 -0.0123507 -0.0386701 0.027922 0.0703808 -0.0315026 0.1277646 -0.1281268 -0.024617 0.0610892 0.0293209 0.0667187 -0.0383048 -0.057989 0.0868534 -0.1156064 0.0351966 0.0464795 -0.0790384 0.012977 -0.1661953 -0.102045 0.0490545 0.0292986 0.0001946 0.061192 -0.0356454 -0.0159559 -0.1766195 -0.0168326 0.0655421 -0.0230649 -0.0202858 -0.00086 -0.2242932 -0.0389023 0.1018737 0.0314861 0.1848271 -0.0208527 -0.0464912 0.0359139 0.0036241 0.0597553 0.0918464 0.0164224 -0.0131156 0.0338785 -0.0467561 -0.0049227 -0.0020097 -0.0051507 0.153663 0.0575285 0.0497775 -0.0204139 0.0223535 -0.0963391 -0.0044049 -0.0108432 -0.0011148 0.14909 -0.0096257 -0.0791632 -0.0444148 -0.0664292 0.0484759 -0.0244194 -0.0506864 -0.0273581 0.1509214 unknown
polarizability: 164.9072699|-12.0574879|112.5621163|17.8358859|-1.125751|66.9559673 unknown
InChI: InChI=1S/C9H10BrN/c1-11-5-7-2-3-9(10)4-8(7)6-11/h2-4H,5-6H2,1H3
charge 0 multiplicity 1
21 atoms
Br -3.812652 0.973474 -0.780617
N  2.652691 0.246349 0.390586
C  1.591922 1.287066 0.621247
C  1.955689 -1.074226 0.579322
C  0.279662 0.598766 0.236824
C  0.495069 -0.802427 0.213562
C  3.27436 0.366132 -0.954524
C  -0.986434 1.145395 -0.045382
C  -0.559956 -1.681822 -0.092209
C  -2.030446 0.245932 -0.359729
C  -1.842078 -1.152189 -0.388651
H  1.806669 2.199427 0.037631
H  1.576011 1.570331 1.693479
H  2.036809 -1.387519 1.640258
H  2.432407 -1.85695 -0.036738
H  3.773559 1.347322 -1.036161
H  2.553656 0.266773 -1.802666
H  4.050039 -0.411531 -1.064836
H  -1.164964 2.22474 -0.027494
H  -0.409018 -2.767005 -0.109592
H  -2.674896 -1.815438 -0.63931
