program: Gaussian 09
title: 000285849
version: EM64L-G09RevD.01
frameworkgroup: C1[X(C11H11BrO4)]
method: RPBEPBE
basis: SDD
operation: Freq
keyword: #p
keyword: freq=noraman
keyword: PBEPBE/SDD
title: #p freq=noraman PBEPBE/SDD
converged: YES YES NO NO
title: Mulliken charges:
elementType: Br O O O O C C C C C C C C C C C H H H H H H H H H H H
charge: 0.033734 -0.299084 -0.287252 -0.433614 -0.248527 0.680067 0.206986 0.210293 -0.519876 -0.457717 -0.292337 -0.267911 -0.300724 -0.529415 -0.528815 0.147803 0.257881 0.276034 0.279328 0.248692 0.229351 0.237048 0.251016 0.236576 0.260767 0.231140 0.378558
chargesum: 0.00000
title: Mulliken charges with hydrogens summed into heavy atoms:
elementType: Br O O O O C C C C C C C C C C C
charge: 0.033734 -0.299084 -0.287252 -0.055056 -0.248527 0.680067 0.206986 0.210293 -0.261995 -0.457717 -0.016303 0.011417 -0.052032 0.187999 0.199668 0.147803
polarizability: 2.70878461e+02 9.56787029e+00 1.80681305e+02 1.40995371e+00 -7.90362880e-01 7.19915394e+01
1716.lowfreq: -5.1689 0.0007 0.0009 0.0009 3.6348 4.8804 30.3506 42.1446 58.1365
frequency: 30.3251 42.1274 58.1322 67.0608 99.1860 114.3533 138.1139 142.5436 157.4667 164.4641 178.9537 189.4127 206.7580 252.1405 262.1125 288.0587 299.4643 373.1689 439.7316 446.5527 479.0307 508.3270 553.4070 579.8717 602.9676 623.4028 655.6970 706.5613 717.8992 739.4767 760.2718 883.2686 887.0185 895.1025 905.2297 939.3819 946.7832 998.1555 1020.6864 1052.3705 1111.5904 1112.7803 1116.8140 1147.7655 1158.7523 1168.4877 1227.1804 1243.6314 1256.0772 1305.9062 1334.8511 1355.3462 1385.0757 1423.6286 1439.4908 1457.6732 1459.0350 1469.4839 1475.1953 1487.0611 1530.0133 1597.6122 1627.8722 1647.1069 2976.0893 2983.7858 3072.5303 3084.1173 3127.3457 3127.7740 3133.5299 3163.2655 3167.6064 3179.3854 3525.2971
redmass: 6.7119 5.3275 4.4418 7.0304 4.7723 2.7421 2.9717 1.3831 1.4470 1.7849 3.6053 6.4913 4.9767 8.5912 5.4845 4.5190 7.2123 4.6926 4.7915 4.6441 4.3103 5.8577 4.5604 1.3717 5.6246 5.5443 3.2016 6.6810 6.9543 2.8795 5.9002 1.6728 1.7756 3.4625 2.0989 5.5482 8.2592 3.4260 1.1858 2.1737 1.5077 1.3553 1.9523 1.4327 1.6664 1.7448 1.3592 1.3425 3.4921 1.8127 2.2974 3.2387 5.5703 1.2303 1.3145 1.0579 1.1650 2.1880 1.0869 1.0538 8.3663 6.8766 8.0812 5.8582 1.0306 1.0307 1.1048 1.1041 1.0902 1.1026 1.1036 1.0918 1.0901 1.0928 1.0641
irintensity: 0.9462 0.0362 1.6298 0.5544 1.7567 10.3919 1.9365 0.4477 0.8344 0.8826 0.3679 1.8940 4.3238 2.6023 9.9222 5.5259 2.5586 1.6173 8.6644 15.2357 11.1963 48.0997 25.1955 120.8041 7.8340 26.4617 37.6470 11.4086 13.8770 8.8709 25.1486 3.1007 21.9813 19.1657 44.9524 13.5617 131.2657 17.6368 43.7475 612.8635 34.5039 38.7232 26.1782 5.4226 24.6982 16.7696 22.3542 1.5669 245.3913 34.0620 39.9397 81.6947 41.4845 16.7388 46.6638 14.3832 51.3299 171.7160 16.5622 20.2392 30.5932 145.5671 362.2959 110.8570 65.9694 78.1655 25.6500 20.6554 1.6777 21.4253 19.2881 2.3782 6.9846 0.9079 58.0921
temp: 298.150 k
press: 1.00000 atm
elementType: 35 8 8 8 8 6 6 6 6 6 6 6 6 6 6 6 1 1 1 1 1 1 1 1 1 1 1
symmnumber: 1
zpe: 517290.3 jmol-1
zpe.correction: 0.197025 hartree
zpe.thermalcorrener: 0.213963 hartree
zpe.thermalcorrenthalpy: 0.214907 hartree
zpe.thermalcorrgfe: 0.150217 hartree
zpe.sumelectzpe: -738.901673 hartree
zpe.sumelectthermal: -738.884736 hartree
zpe.sumelectthermalent: -738.883792 hartree
zpe.sumelectthermalfe: -738.948481 hartree
dipole: 4.5499 -2.2525 0.0625
dipole: 5.0774
quadrupole: -92.4276 -99.8236 -101.9712
quadrupole: 1.5872 1.1312 4.4340
quadrupole: 5.6465 -1.7494 -3.8971 1.5872 1.1312 4.4340
hfenergy: -739.0986989 hartree
pointgroup: C01 [X(C11H11Br1O4)]
dipole: -1.7014649 1.0438034 0.0764848 debye
polarizability: 271.87596|1.157353|179.1680117|0.2311222|7.5550251|72.5073341 unknown
InChI: InChI=1S/C11H11BrO4/c1-15-9-5-7(3-4-11(13)14)8(12)6-10(9)16-2/h3-6,13H,1-2H3
charge 0 multiplicity 1
27 atoms
Br 0.744414 -3.461037 -0.423978
O  -2.312216 1.902067 0.086621
O  -3.722225 -0.673763 -0.138189
O  4.875863 1.763713 0.344132
O  4.956454 -0.531209 -0.051785
C  0.553545 -0.510384 -0.094537
C  -1.628472 0.670648 -0.01927
C  -2.322502 -0.575863 -0.112009
C  -0.227288 0.680451 0.007117
C  -0.173543 -1.731521 -0.243205
C  -1.579354 -1.768056 -0.246503
C  2.017977 -0.472419 -0.069698
C  2.803697 0.631608 0.127725
C  -3.099914 2.271154 -1.116432
C  -4.431761 -0.119578 1.044668
C  4.271865 0.508907 0.121236
H  0.265356 1.653711 0.088732
H  -2.125584 -2.710274 -0.334638
H  2.542414 -1.424671 -0.221524
H  2.407648 1.636169 0.302961
H  -2.424312 2.417109 -1.979775
H  -3.593947 3.220225 -0.860735
H  -3.849728 1.494923 -1.354046
H  -5.501364 -0.206487 0.803939
H  -4.151063 0.933392 1.219158
H  -4.193607 -0.727289 1.936913
H  5.864149 1.647273 0.334424
