program: Gaussian 09
title: 000285840
version: EM64L-G09RevD.01
frameworkgroup: C1[X(C9H19N3)]
method: RPBEPBE
basis: SDD
operation: Freq
keyword: #pfreq=noraman
keyword: PBEPBE/SDD
title: #p freq=noraman PBEPBE/SDD
converged: YES YES NO NO
title: Mulliken charges:
elementType: N N N C C C C C C C C C H H H H H H H H H H H H H H H H H H H
charge: -0.160573 -0.392993 -0.112148 -0.412779 -0.455608 0.164853 -0.031252 -0.094209 -0.710381 -0.679845 -0.692989 -0.688649 0.242690 0.243835 0.239421 0.241971 0.288440 0.245024 0.192396 0.229045 0.195857 0.218125 0.190239 0.204881 0.255906 0.239016 0.215305 0.199524 0.216478 0.217214 0.191207
chargesum: 0.00000
title: Mulliken charges with hydrogens summed into heavy atoms:
elementType: N N N C C C C C C C C C
charge: -0.160573 -0.104553 -0.112148 0.073746 0.025785 0.164853 0.213772 0.098187 -0.067354 -0.028819 -0.039144 -0.063751
polarizability: 1.42009768e+02 -5.00671706e+00 1.30533357e+02 -1.09487476e+00 2.55200053e+00 9.46309938e+01
1716.lowfreq: -13.5942 -8.9617 -0.0005 -0.0004 0.0005 8.3928 28.3510 47.2287 68.4262
frequency: 27.4945 47.1646 68.4008 96.1573 111.3831 135.7189 152.2264 208.0431 213.4509 219.3049 238.7135 250.2233 275.9686 306.8341 325.4606 393.6442 403.2966 425.9008 450.2751 457.4103 490.5405 594.2172 673.4361 708.2663 808.4271 825.5957 853.0938 866.6669 892.9245 913.4099 915.8161 936.8044 941.7590 962.5847 995.1116 1015.0431 1077.1514 1094.8521 1109.8461 1120.5031 1132.1630 1140.1578 1146.3738 1160.6962 1170.2969 1185.4777 1226.2622 1283.7021 1300.1061 1313.3370 1338.5003 1346.7589 1365.7638 1370.4254 1385.4881 1388.6940 1454.0830 1455.6622 1457.3023 1462.6171 1466.4284 1467.5631 1468.5912 1474.8819 1485.1694 1486.5508 1488.3515 1621.9202 2917.3356 2969.7933 2973.9980 2974.6297 2979.7298 3029.6992 3061.8761 3065.4465 3072.0962 3073.8934 3075.2057 3080.0646 3081.4811 3086.8517 3088.5381 3092.7511 3170.0886 3186.9155 3545.3263
redmass: 2.6105 2.6423 3.4955 3.0140 2.7407 3.3924 3.1493 1.0291 1.0687 2.9846 1.1254 1.3340 2.0409 2.2100 2.4462 3.2117 2.4177 1.2873 3.1677 2.8047 2.7322 4.2497 7.8036 3.6907 1.8597 1.4208 3.7597 3.3094 2.6897 1.2007 1.2536 1.3894 1.4515 1.6372 1.2666 2.2692 1.2426 1.3281 1.6906 1.7900 2.1607 2.1094 1.4566 2.0278 1.9829 2.6063 2.4856 1.9913 1.3673 2.0796 1.3915 1.3165 1.2169 1.2179 1.2246 1.2344 1.1861 1.1007 1.0830 1.1329 1.0470 1.0603 1.0495 1.1419 1.1423 1.1387 1.0514 9.1810 1.0810 1.0376 1.0344 1.0366 1.0351 1.0851 1.0979 1.0483 1.0968 1.0644 1.0960 1.0993 1.1006 1.0996 1.1000 1.0996 1.1176 1.1176 1.0762
irintensity: 0.3188 0.2819 4.0877 3.6978 0.5013 0.1005 0.4068 0.1034 0.3258 4.8172 1.1242 3.6753 5.9208 6.1909 1.7516 5.3575 5.6264 86.9295 16.1860 31.3779 1.1562 2.4878 9.8792 1.4295 3.4406 11.2475 1.5903 3.2904 6.6489 1.2995 6.8137 0.1410 0.6446 6.8303 6.9945 45.3507 6.0292 14.1530 22.1891 15.0330 6.8834 20.5167 1.7224 10.1541 3.0136 84.8021 42.7813 53.7041 10.0517 87.3765 60.2046 23.0904 20.1828 31.6471 28.2719 27.1568 90.5806 37.8646 4.3253 42.5442 5.1807 0.8878 3.8640 10.1900 14.1964 60.7406 14.5475 411.9791 56.8384 27.2553 29.4397 46.2883 41.7579 0.4128 6.2660 21.8211 10.6938 32.5137 73.2169 68.9118 28.7429 53.6873 34.8426 29.6269 1.4444 30.8130 16.4695
temp: 298.150 k
press: 1.00000 atm
elementType: 7 7 7 6 6 6 6 6 6 6 6 6 1 1 1 1 1 1 1 1 1 1 1 1 1 1 1 1 1 1 1
symmnumber: 1
zpe: 712807.8 jmol-1
zpe.correction: 0.271494 hartree
zpe.thermalcorrener: 0.286549 hartree
zpe.thermalcorrenthalpy: 0.287493 hartree
zpe.thermalcorrgfe: 0.229244 hartree
zpe.sumelectzpe: -517.570461 hartree
zpe.sumelectthermal: -517.555407 hartree
zpe.sumelectthermalent: -517.554463 hartree
zpe.sumelectthermalfe: -517.612712 hartree
dipole: -0.8945 2.7344 -0.3543
dipole: 2.8987
quadrupole: -69.5694 -70.8423 -77.9173
quadrupole: 1.1009 -1.5455 -0.8333
quadrupole: 3.2069 1.9340 -5.1409 1.1009 -1.5455 -0.8333
hfenergy: -517.8419557 hartree
pointgroup: C01 [X(C9H19N3)]
dipole: 0.6336463 0.9366487 0.1476901 debye
polarizability: 143.4040529|1.4241469|128.9107392|-4.4991749|-0.6242521|94.859327 unknown
InChI: InChI=1S/C9H19N3/c1-7(2)10-9(11-8(3)4)12-5-6-12/h7-8,10H,5-6H2,1-4H3
charge 0 multiplicity 1
31 atoms
N  -0.129794 1.716434 -0.506344
N  1.569126 0.099957 -0.158978
N  -0.655261 -0.564861 0.242934
C  -0.79045 2.68006 0.431677
C  0.647447 2.909693 -0.023189
C  0.197278 0.369862 -0.096588
C  2.096295 -1.274592 -0.019668
C  -2.11795 -0.325855 0.260427
C  3.580085 -1.20615 0.392771
C  1.887731 -2.104211 -1.310487
C  -2.687091 -0.460443 -1.17626
C  -2.756059 -1.355305 1.21523
H  -0.932175 2.369174 1.474332
H  -1.605626 3.272189 0.003684
H  0.859676 3.670963 -0.780595
H  1.436841 2.748702 0.722495
H  2.153095 0.779068 -0.650809
H  1.501688 -1.742264 0.785491
H  -2.380544 0.693454 0.624728
H  3.703515 -0.647349 1.337495
H  4.189887 -0.710044 -0.388607
H  3.986575 -2.223518 0.532364
H  2.470816 -1.682768 -2.15171
H  2.210498 -3.151036 -1.158224
H  0.818164 -2.107675 -1.581332
H  -2.243988 0.301357 -1.842327
H  -2.446361 -1.46035 -1.581463
H  -3.786537 -0.337054 -1.177406
H  -2.347662 -1.245747 2.235819
H  -2.525426 -2.378574 0.86808
H  -3.854493 -1.231719 1.257261
