program: Gaussian 09
title: 000285829
version: EM64L-G09RevD.01
frameworkgroup: C1[X(C4H7Cl3O3)]
method: RPBEPBE
basis: SDD
operation: Freq
keyword: #p
keyword: freq=noraman
keyword: PBEPBE/SDD
title: #p freq=noraman PBEPBE/SDD
converged: YES YES NO NO
title: Mulliken charges:
elementType: Cl Cl Cl O O O C C C C H H H H H H H
charge: 0.128154 0.098458 0.118257 -0.266244 -0.377950 -0.441257 0.115794 -0.238488 -0.648044 -0.323544 0.261535 0.217276 0.219455 0.208023 0.216377 0.358886 0.353312
chargesum: 0.00000
title: Mulliken charges with hydrogens summed into heavy atoms:
elementType: Cl Cl Cl O O O C C C C
charge: 0.128154 0.098458 0.118257 -0.266244 -0.019063 -0.087945 0.377329 0.198243 -0.648044 0.100856
polarizability: 9.34314150e+01 -5.70606739e+00 8.09435618e+01 -3.35123611e+00 -3.28017053e+00 7.60387999e+01
1716.lowfreq: -7.0361 -0.0043 -0.0034 -0.0012 6.3905 11.4914 29.3967 45.1939 70.1578
frequency: 29.1839 45.1277 70.0225 127.9572 137.5914 186.3505 202.4609 246.2754 247.9060 267.2787 301.8359 357.8718 371.0584 421.6257 458.1969 482.7868 561.7982 612.1643 729.0225 756.8191 846.5275 866.0592 946.1208 977.1911 1003.3831 1049.1292 1062.3684 1092.8757 1187.8199 1209.5471 1238.5115 1299.1970 1330.5144 1363.4319 1375.0416 1381.7898 1458.7568 1460.1486 2973.3086 2978.6443 3032.2050 3052.6269 3083.9112 3508.1808 3541.5809
redmass: 7.0403 7.3322 5.2433 5.1503 5.5979 9.0840 5.9935 7.2402 10.5781 5.6192 4.9250 5.6827 4.8684 1.5374 1.1352 2.8826 4.4579 4.0187 7.4415 8.3707 2.6737 2.6223 3.9800 2.9785 5.6592 3.2504 5.8032 1.8155 1.1772 1.2125 1.3565 1.1783 1.2112 1.2719 1.1758 1.3038 1.0806 1.0907 1.0688 1.0562 1.0850 1.1062 1.0965 1.0648 1.0656
irintensity: 1.4885 1.9102 1.0431 2.4063 2.3183 5.3784 0.3204 4.9661 3.1061 0.1172 0.4754 2.1576 20.7719 111.0408 165.1141 55.7881 90.1427 75.5269 118.5018 93.4140 35.6006 15.7970 100.6422 11.8425 275.6578 39.6628 129.2179 4.9467 7.6380 17.9698 44.1940 21.1331 9.3967 19.1138 10.0694 19.6966 15.9457 1.2381 39.2142 43.2249 16.7970 41.1074 29.1988 17.4583 12.4362
temp: 298.150 k
press: 1.00000 atm
elementType: 17 17 17 8 8 8 6 6 6 6 1 1 1 1 1 1 1
symmnumber: 1
zpe: 298660.9 jmol-1
zpe.correction: 0.113754 hartree
zpe.thermalcorrener: 0.125896 hartree
zpe.thermalcorrenthalpy: 0.126841 hartree
zpe.thermalcorrgfe: 0.073486 hartree
zpe.sumelectzpe: -1761.615700 hartree
zpe.sumelectthermal: -1761.603558 hartree
zpe.sumelectthermalent: -1761.602614 hartree
zpe.sumelectthermalfe: -1761.655969 hartree
dipole: -0.3430 -2.2329 0.1857
dipole: 2.2667
quadrupole: -85.5349 -81.4081 -77.9350
quadrupole: 8.7154 0.3161 -2.4543
quadrupole: -3.9089 0.2179 3.6910 8.7154 0.3161 -2.4543
hfenergy: -1761.7294543 hartree
pointgroup: C01 [X(C4H7Cl3O3)]
dipole: -0.0798646 0.7644571 -0.4522338 debye
dipolederiv: -0.6360341 -0.2040808 -0.2180578 -0.1710208 -0.2071114 -0.0880181 -0.2095504 -0.1050524 -0.233618 -0.1588512 0.0395734 0.082063 0.044767 -0.2207036 -0.1388164 0.0510617 -0.1431381 -0.7274012 -0.2716979 -0.1575646 0.12758 -0.1989172 -0.5019714 0.2831238 0.1543196 0.2650551 -0.3417352 -1.5264057 0.0437646 -0.020452 0.0500434 -0.4693025 0.0954935 -0.1283383 -0.0207273 -0.3698221 -0.7575323 0.0288875 -0.0056054 -0.1795963 -0.6972616 0.3020831 0.083042 0.3573996 -0.3592531 -0.3138708 -0.095006 -0.1348476 -0.1814947 -0.7181386 0.0904225 -0.1257097 0.0768618 -0.545613 1.2112524 -0.0343242 0.0138488 0.2560207 0.6608299 -0.2572816 0.1606118 -0.2692697 0.3620792 0.7546613 -0.2118043 -0.0348193 -0.3576017 0.2340748 -0.016361 -0.1574778 0.002284 0.2980494 0.9686814 0.4139832 -0.0001659 0.4217908 0.823834 0.0382741 0.002142 -0.0020624 1.3638974 0.213399 0.0106695 0.0364624 0.0365571 0.5010488 -0.1427877 0.0537511 -0.0968383 0.4475098 -0.00684 0.0283238 0.0591138 -0.0268916 0.0180589 -0.0593634 -0.0418079 0.0110579 -0.0668846 -0.0240161 -0.0055497 -0.0596506 0.0671601 0.043587 -0.0376185 0.0164269 -0.0972391 -0.1351637 -0.0235748 -0.023271 0.0223292 0.0874022 -0.1018152 0.0897038 -0.0012891 0.1164123 0.0060166 0.0870207 -0.0077315 0.0390681 -0.0342563 -0.0051292 -0.0274756 -0.026726 0.0003268 -0.2101159 -0.095991 0.0996848 0.0090896 0.0687916 0.0065861 0.0155201 0.0547052 -0.0097561 0.0828949 0.4033071 -0.0503717 0.0246984 -0.0254235 0.3026434 -0.1690684 0.0228655 -0.1167229 0.1529558 0.1764918 0.124817 0.0593454 0.1426693 0.3307707 0.0221697 0.0919734 0.0314086 0.2762037 unknown
polarizability: 94.0940586|5.7639233|76.735974|0.6919262|-3.8216861|79.5837442 unknown
InChI: InChI=1S/C4H7Cl3O3/c5-4(6,7)3(9)10-2-1-8/h3,8-9H,1-2H2
charge 0 multiplicity 1
17 atoms
Cl 3.080312 0.024683 1.027427
Cl 1.775576 -1.158994 -1.436678
Cl 0.866789 -1.998984 1.34406
O  -0.787209 0.025858 -0.179876
O  0.888877 1.721162 -0.433653
O  -3.19199 -1.228302 0.709605
C  0.43993 0.581666 0.322844
C  -1.993134 0.846452 0.114326
C  1.479646 -0.581733 0.315431
C  -3.178347 -0.069759 -0.183298
H  0.339796 0.955575 1.360365
H  -1.983032 1.136686 1.18452
H  -1.993687 1.753893 -0.519066
H  -3.147095 -0.381056 -1.248384
H  -4.123703 0.466571 0.00377
H  1.054924 1.440251 -1.373953
H  -2.304955 -1.668369 0.639559
