program: Gaussian 09
title: 000285868
version: EM64L-G09RevD.01
frameworkgroup: C1[X(C19H26O6)]
method: RPBEPBE
basis: SDD
operation: Freq
keyword: #pfreq=noraman
keyword: PBEPBE/SDD
title: #p freq=noraman PBEPBE/SDD
converged: NO YES NO NO
title: Mulliken charges:
elementType: O O O O O O C C C C C C C C C C C C C C C C C C C H H H H H H H H H H H H H H H H H H H H H H H H H H
charge: -0.238793 -0.238230 -0.268417 -0.257870 -0.289822 -0.268251 -0.430644 -0.431864 -0.409031 -0.409886 -0.065696 -0.070789 -0.386466 -0.386569 -0.308517 -0.310191 0.212252 0.207284 -0.432427 -0.312973 0.259518 -0.390568 0.169918 -0.256860 -0.667991 0.205922 0.222503 0.206944 0.224446 0.218219 0.227649 0.229268 0.219774 0.246701 0.248393 0.208336 0.203102 0.209071 0.204630 0.219558 0.212250 0.220504 0.213728 0.334238 0.297498 0.268227 0.231856 0.219670 0.252003 0.224941 0.213451
chargesum: 0.00000
title: Mulliken charges with hydrogens summed into heavy atoms:
elementType: O O O O O O C C C C C C C C C C C C C C C C C C C
charge: -0.238793 -0.238230 -0.268417 -0.257870 -0.289822 -0.268251 -0.002219 -0.000474 0.036837 0.039156 0.181005 0.177604 0.024972 0.027132 0.123291 0.124041 0.212252 0.207284 -0.098189 -0.015476 0.259518 -0.122341 0.169918 0.194666 0.022404
polarizability: 3.06315265e+02 -8.30342893e+00 2.38161257e+02 4.23077024e-01 6.62304316e+00 1.61760617e+02
1716.lowfreq: -43.4872 -42.1389 -6.1107 -0.0007 0.0004 0.0005 1.4460 14.1442 23.4789
frequency: -42.5849 -32.8111 23.3530 33.6883 44.2491 49.3363 61.3197 74.1163 87.0689 101.1588 109.2514 143.8846 151.0549 176.3586 185.0794 205.9490 219.8633 236.0513 256.7775 293.3016 308.4826 313.7854 336.2413 347.2207 366.5798 378.4719 411.2900 421.5534 434.5987 462.4304 472.5730 481.8407 499.7593 520.2217 537.5820 566.1424 616.5479 625.6427 648.8708 678.4326 710.9591 730.3494 745.5139 764.2806 772.2134 774.5255 795.3079 814.3502 819.9538 830.8380 836.6661 845.0212 847.4235 862.0033 871.7890 876.1818 884.3042 918.4167 930.9555 933.1179 935.1918 964.7928 1007.9903 1010.4143 1011.3342 1018.1709 1018.8236 1050.7876 1052.6296 1068.0975 1095.8511 1101.7567 1104.8143 1109.0837 1117.2175 1119.5545 1156.2738 1169.9464 1172.1335 1177.4887 1183.7869 1187.7230 1226.8589 1250.8510 1251.6389 1256.8514 1269.6925 1270.2176 1280.3225 1286.9251 1309.1483 1311.9631 1332.0135 1334.7779 1342.5632 1343.1460 1347.7236 1348.0716 1353.7630 1354.1323 1357.7382 1365.4203 1365.5569 1388.8425 1389.2409 1410.9357 1446.2344 1446.3935 1456.4011 1456.5727 1457.2809 1460.4947 1462.7873 1463.1317 1472.9551 1476.3595 1485.1636 1497.1952 1576.8290 1602.4136 1615.7491 2985.2787 2985.5146 2988.3332 2990.8810 2992.7000 2997.7315 2999.2499 3001.6232 3003.2737 3025.8036 3028.8324 3032.3610 3044.9121 3045.8817 3059.6479 3061.2675 3073.6775 3075.4970 3085.7306 3090.5348 3090.7494 3092.4002 3116.2970 3158.5101 3179.0649 3192.0054
redmass: 3.8023 3.9891 4.2718 3.8738 3.8096 4.6447 4.0307 4.0929 4.1452 4.5573 3.6170 3.6399 3.5324 3.6247 3.2770 2.5044 2.0932 3.0467 2.3295 2.9260 2.8449 2.7384 3.0073 2.5539 2.8684 4.2622 3.9753 4.0053 3.8177 3.4593 3.8308 3.6914 3.4524 2.5586 3.1908 5.4037 5.0730 6.0327 3.6785 3.6113 5.2361 3.4513 4.0806 3.9763 4.2590 3.3651 2.0034 1.4488 1.8889 2.7517 1.5423 2.8442 2.8894 2.3729 2.7938 2.7182 3.0414 1.5981 1.5370 1.6248 3.2096 1.3524 2.6473 2.5989 2.7073 2.5806 2.6239 1.9114 1.9040 3.4546 2.1490 2.0126 1.9787 2.2745 2.0883 2.4095 1.6798 1.3590 1.2897 1.4649 1.4606 1.5845 2.2821 1.2579 1.2531 3.2882 1.2072 1.2112 1.1257 1.4655 1.3534 1.4541 1.2011 1.2332 1.3759 1.3765 1.5090 1.5196 1.4020 1.3991 1.3189 1.2727 1.2780 2.7690 1.5777 5.4995 1.0894 1.0896 1.1003 1.0917 1.0881 1.0850 1.0845 1.0442 1.0902 1.0927 1.0556 2.8685 8.2530 6.5266 9.9460 1.0599 1.0600 1.0659 1.0361 1.0658 1.0606 1.0604 1.0646 1.0644 1.0592 1.0865 1.0868 1.1002 1.1000 1.1010 1.1011 1.1022 1.1021 1.0975 1.1035 1.1013 1.1017 1.1054 1.0888 1.0960 1.0920
irintensity: 0.0317 0.4970 0.7818 0.0741 0.2243 0.7411 0.5005 1.2448 0.1460 2.5245 2.0115 2.5951 3.6420 1.5947 11.0559 0.7917 3.8200 2.4716 5.2048 0.1628 4.0483 19.9377 0.2709 7.5739 1.6652 3.6784 8.3084 12.5002 2.6314 1.0672 6.6414 0.1273 2.9999 8.3821 7.9031 0.0129 14.1551 19.4288 5.4733 9.0884 19.2258 1.1395 14.7425 24.5117 43.3407 2.0235 74.1748 2.1895 11.1495 0.9465 24.5790 15.7099 34.0003 91.1873 135.0883 51.4155 260.7900 68.2429 47.5476 1.8732 118.6653 1.8193 130.1857 77.3630 68.4529 33.0673 44.4947 11.0569 14.5332 228.1014 58.1273 82.4405 7.6393 259.7895 0.6777 49.1869 26.2964 46.6702 0.7680 83.7487 40.5693 37.0797 19.6711 25.7735 26.8275 569.1404 8.8176 9.3657 1.6690 37.2189 6.4060 11.7536 18.1308 8.4465 0.5308 0.6002 12.9147 0.5732 0.2606 0.8143 18.4541 2.7632 0.5060 9.7082 21.8067 28.2072 16.2352 2.4644 40.6200 13.2137 10.7551 8.9910 8.5839 14.0214 12.9319 18.7074 21.7537 135.7501 100.5338 143.8116 157.4288 50.8650 27.1361 31.1515 25.8511 31.5024 26.1205 31.8546 17.9108 17.1055 38.1524 45.0732 44.8038 28.2900 28.2129 50.2610 53.3464 43.0597 37.5534 42.6793 2.9250 39.0478 37.2415 31.4821 0.3143 1.0701 4.3877
temp: 298.150 k
press: 1.00000 atm
elementType: 8 8 8 8 8 8 6 6 6 6 6 6 6 6 6 6 6 6 6 6 6 6 6 6 6 1 1 1 1 1 1 1 1 1 1 1 1 1 1 1 1 1 1 1 1 1 1 1 1 1 1
symmnumber: 1
zpe: 1111332.5 jmol-1
zpe.correction: 0.423284 hartree
zpe.thermalcorrener: 0.445921 hartree
zpe.thermalcorrenthalpy: 0.446865 hartree
zpe.thermalcorrgfe: 0.370225 hartree
zpe.sumelectzpe: -1189.033440 hartree
zpe.sumelectthermal: -1189.010803 hartree
zpe.sumelectthermalent: -1189.009859 hartree
zpe.sumelectthermalfe: -1189.086499 hartree
dipole: -3.3682 3.7594 0.8201
dipole: 5.1137
quadrupole: -129.1846 -148.6271 -141.6448
quadrupole: 7.7842 1.7502 -3.4659
quadrupole: 10.6342 -8.8083 -1.8259 7.7842 1.7502 -3.4659
hfenergy: -1189.4567241 hartree
pointgroup: C01 [X(C19H26O6)]
dipole: -1.1555896 -1.6277709 -0.2503611 debye
polarizability: 303.6188396|15.5611392|241.2064153|-2.9237341|3.3300797|161.4118842 unknown
InChI: InChI=1S/C19H26O6/c1-2-21-19(20)14-9-10-15(24-17-7-3-5-11-22-17)16(13-14)25-18-8-4-6-12-23-18/h9-10,13,17-18H,2-8,11-12H2,1H3
charge 0 multiplicity 1
51 atoms
O  1.759332 -2.885223 0.215709
O  -3.584017 2.143782 0.09094
O  -0.269432 -1.571305 -0.08078
O  -2.173223 0.193348 0.441763
O  4.153511 0.969276 0.054835
O  3.610965 3.196997 0.501327
C  -0.167027 -3.741014 -1.105702
C  -4.434265 0.110304 1.24809
C  -0.670612 -4.522462 0.130532
C  -5.051517 -0.390518 -0.078063
C  0.679774 -2.530528 -0.689062
C  -3.252869 1.053434 0.987598
C  0.519614 -4.88763 1.049121
C  -5.410395 0.813366 -0.981213
C  1.301309 -3.618307 1.425959
C  -4.168605 1.693514 -1.201919
C  0.163924 -0.248426 0.127575
C  -0.869163 0.7048 0.399606
C  1.509085 0.165231 0.096641
C  -0.534434 2.065556 0.600599
C  1.837504 1.530424 0.313775
C  0.812362 2.474046 0.560478
C  3.245157 2.00869 0.303588
C  5.595957 1.347144 0.024915
C  6.002607 1.839701 -1.367553
H  0.472596 -4.393939 -1.730201
H  -1.008519 -3.389001 -1.728023
H  -5.189659 0.676695 1.826033
H  -4.085695 -0.731254 1.872049
H  -1.206281 -5.433952 -0.192298
H  -1.39075 -3.893303 0.687155
H  -4.320391 -1.039698 -0.595699
H  -5.949127 -1.000936 0.130121
H  1.190508 -2.043479 -1.540772
H  -2.887841 1.551864 1.904613
H  1.195357 -5.593277 0.527574
H  0.165612 -5.385191 1.972721
H  -6.20803 1.41654 -0.505329
H  -5.791168 0.470661 -1.96269
H  2.232199 -3.84413 1.97011
H  0.67419 -2.94004 2.038241
H  -4.406032 2.631887 -1.72788
H  -3.393342 1.141157 -1.769012
H  2.309343 -0.562729 -0.049134
H  -1.328967 2.802129 0.742693
H  1.086268 3.522283 0.713766
H  5.773044 2.124268 0.789348
H  6.114484 0.414598 0.300794
H  5.482598 2.780168 -1.61497
H  5.763958 1.084619 -2.136541
H  7.092105 2.029164 -1.39403
