program: Gaussian 09
title: 000285813
version: EM64L-G09RevD.01
frameworkgroup: C1[X(C18H17NO2)]
method: RPBEPBE
basis: SDD
operation: Freq
keyword: #p
keyword: freq=noraman
keyword: PBEPBE/SDD
title: #p freq=noraman PBEPBE/SDD
converged: YES YES NO NO
title: Mulliken charges:
elementType: O O N C C C C C C C C C C C C C C C C C C H H H H H H H H H H H H H H H H H
charge: -0.295701 -0.264442 -0.057105 0.547164 0.361998 0.243903 -0.401377 -0.454985 0.206415 -0.455175 0.436108 0.186290 -0.363037 -0.392044 -0.352975 -0.394077 -0.404364 -0.807873 -0.311718 -0.538410 -0.493557 0.221485 0.263017 0.231578 0.247899 0.219475 0.255770 0.231582 0.229916 0.237623 0.226731 0.225247 0.239921 0.239193 0.236350 0.226487 0.231437 0.241251
chargesum: 0.00000
title: Mulliken charges with hydrogens summed into heavy atoms:
elementType: O O N C C C C C C C C C C C C C C C C C C
charge: -0.295701 -0.264442 -0.057105 0.547164 0.361998 0.243903 -0.179892 -0.191967 0.206415 -0.223598 0.436108 0.186290 -0.115138 -0.172569 -0.097205 -0.162495 -0.174449 -0.118272 -0.311718 0.177055 0.205618
polarizability: 4.72384998e+02 -1.96092039e+01 2.22670051e+02 -5.29510008e-01 -4.09505447e+00 9.80948481e+01
1716.lowfreq: -22.7910 -7.1369 -2.5345 -0.0007 0.0004 0.0005 3.6634 7.6818 20.6452
frequency: -22.5635 4.7473 20.4626 29.8179 47.5923 58.7961 91.5120 96.4984 127.4880 148.5853 157.1084 197.0883 198.6988 215.4204 226.3328 257.6900 282.0978 289.0666 330.8210 349.2857 354.2701 385.7048 401.0240 404.4117 428.0655 455.8165 488.1093 504.3779 545.1178 565.4648 606.4296 610.7301 637.5150 652.5608 705.8767 721.2517 728.5801 740.3832 767.7450 802.6310 814.1771 828.9258 842.9081 868.7600 915.9910 921.1242 951.7792 953.9351 966.5181 974.1799 984.3879 987.2096 1007.6936 1021.4135 1046.1542 1107.7831 1109.1562 1119.2296 1134.1601 1153.8700 1156.2603 1168.5514 1202.3943 1220.3902 1233.2824 1258.4283 1276.3320 1294.4959 1315.6415 1336.4128 1373.2938 1393.9736 1396.7036 1416.3405 1422.3394 1439.2989 1450.2008 1457.6391 1462.8229 1467.9658 1470.1894 1472.8263 1472.9242 1496.6391 1510.8276 1561.5461 1571.3074 1581.5794 1611.8161 1623.0836 2142.2784 2972.7450 2974.0031 3003.2524 3055.3189 3065.3837 3085.3977 3111.5534 3113.4955 3118.9382 3121.9940 3128.8513 3129.1547 3132.9418 3142.4257 3147.9096 3170.4291 3204.3324
redmass: 2.9101 1.0229 3.9603 5.0730 5.7108 4.7710 4.0796 3.7732 5.1723 9.0252 2.9540 1.8402 2.0046 2.2876 4.1075 2.4892 3.4207 2.0893 3.6098 5.0995 4.4237 4.2620 3.5121 3.3787 6.5902 3.0807 5.3944 3.0773 6.3253 5.1802 5.8023 4.2664 6.8981 4.9129 6.3338 2.8363 3.1006 5.6446 5.8603 5.5652 1.3971 1.5519 1.2795 1.5260 3.4651 1.7812 1.4411 1.3410 8.4799 1.3807 4.3192 1.6050 3.3248 2.6683 1.5657 1.2575 1.2524 1.9896 1.3516 1.3967 1.5730 1.7950 1.1577 2.4359 2.3326 2.8624 2.6597 1.8915 1.3506 2.1958 5.0922 2.9689 1.2336 3.1527 1.9385 1.2357 1.6065 1.0524 1.0744 1.0496 1.1004 1.0783 1.0755 2.4859 2.6389 7.2490 5.2897 5.9766 6.1990 6.2946 12.6210 1.0321 1.0389 1.0285 1.0946 1.1044 1.0998 1.0873 1.1047 1.0870 1.0877 1.1057 1.1010 1.0893 1.0951 1.0967 1.0950 1.0892
irintensity: 5.1733 0.6199 1.8133 0.9285 6.2900 1.3328 3.8035 2.7145 2.4552 4.1133 0.8071 0.3820 0.4016 2.5849 0.8595 2.0448 3.3009 0.9224 7.7747 2.9912 0.5721 1.5740 0.4207 0.3108 19.9358 1.2096 4.1133 20.3137 1.6118 27.6959 1.6568 15.2682 0.3381 0.7551 8.8679 1.6211 5.0761 1.9735 5.3445 0.2597 16.1475 59.0494 10.8846 18.1908 8.5752 18.0008 1.5914 3.2260 55.4006 0.1152 25.3127 2.8800 23.5445 18.6494 27.2082 0.2569 0.3570 92.8395 11.6331 0.4107 63.0107 32.2463 11.2794 2.9817 0.4709 187.6697 237.8212 180.3207 15.7327 6.3177 13.6883 179.6040 15.8225 1.1939 15.7524 5.9656 25.9125 13.0217 36.1391 17.4214 12.5602 49.6638 56.4740 111.0466 133.0265 68.4204 19.2717 136.7561 54.3916 21.0992 73.1842 30.8481 49.9661 103.2352 23.4819 32.5898 17.2527 21.7925 33.5975 8.2450 26.0758 27.4545 27.9872 7.6495 27.8728 3.8841 9.9276 6.3587
temp: 298.150 k
press: 1.00000 atm
elementType: 8 8 7 6 6 6 6 6 6 6 6 6 6 6 6 6 6 6 6 6 6 1 1 1 1 1 1 1 1 1 1 1 1 1 1 1 1 1
symmnumber: 1
zpe: 785231.4 jmol-1
zpe.correction: 0.299079 hartree
zpe.thermalcorrener: 0.318929 hartree
zpe.thermalcorrenthalpy: 0.319873 hartree
zpe.thermalcorrgfe: 0.246900 hartree
zpe.sumelectzpe: -899.774820 hartree
zpe.sumelectthermal: -899.754970 hartree
zpe.sumelectthermalent: -899.754026 hartree
zpe.sumelectthermalfe: -899.826999 hartree
dipole: 0.2841 -1.2798 0.4087
dipole: 1.3732
quadrupole: -91.9980 -119.7334 -128.4863
quadrupole: 12.1176 2.1439 -1.6533
quadrupole: 21.4079 -6.3275 -15.0804 12.1176 2.1439 -1.6533
hfenergy: -900.0738992 hartree
pointgroup: C01 [X(C18H17N1O2)]
dipole: 0.0995869 0.5212202 -0.1014463 debye
polarizability: 471.0798087|25.7630528|223.1706049|7.3355045|10.4349617|98.899484 unknown
InChI: InChI=1S/C18H17NO2/c1-13-4-7-15(8-5-13)16(12-19)10-14-6-9-17(20-2)18(11-14)21-3/h4-11H,1-3H3
charge 0 multiplicity 1
38 atoms
O  4.242194 -1.284539 0.138328
O  5.294859 1.407435 0.645391
N  -0.41273 -2.837589 -0.037138
C  1.084334 0.763151 0.488317
C  -2.738743 -0.186297 0.257863
C  -1.255537 -0.357304 0.274775
C  -0.372869 0.698797 0.463626
C  1.960154 -0.344769 0.280581
C  3.359532 -0.204589 0.321101
C  1.681404 2.035265 0.739767
C  -5.606916 0.104637 0.261143
C  3.94277 1.085561 0.566027
C  -3.595752 -1.309551 0.428892
C  -3.351237 1.085158 0.071238
C  3.074237 2.185885 0.775139
C  -4.997036 -1.163749 0.434104
C  -4.752326 1.224068 0.08018
C  -7.117106 0.255436 0.233418
C  -0.782027 -1.705638 0.104351
C  3.652023 -2.608807 -0.10107
C  6.368442 0.457055 0.293331
H  -0.84897 1.672976 0.638827
H  1.539131 -1.331873 0.090851
H  1.040909 2.909189 0.905243
H  -3.159503 -2.305091 0.569603
H  -2.736924 1.97458 -0.107083
H  3.538081 3.158511 0.963509
H  -5.627621 -2.04978 0.576313
H  -5.193666 2.217249 -0.068541
H  -7.511551 0.117448 -0.792452
H  -7.610311 -0.49472 0.876433
H  -7.431433 1.25797 0.573109
H  3.019828 -2.926692 0.749174
H  4.511923 -3.286774 -0.203383
H  3.05136 -2.619425 -1.029982
H  7.289736 1.051486 0.393158
H  6.252705 0.094237 -0.741407
H  6.380938 -0.401308 0.982963
