program: Gaussian 09
title: 000285799
version: EM64L-G09RevD.01
frameworkgroup: C1[X(C9H13IO)]
method: RPBEPBE
basis: SDD
operation: Freq
keyword: #p
keyword: freq=noraman
keyword: PBEPBE/SDD
title: #p freq=noraman PBEPBE/SDD
converged: YES YES NO NO
title: Mulliken charges:
elementType: I O C C C C C C C C C H H H H H H H H H H H H H
charge: 0.095115 -0.156421 -0.221618 0.263314 -0.453851 -0.482769 -0.465456 -0.421394 0.220476 -0.751832 -0.737677 0.255649 0.246940 0.261177 0.229883 0.229022 0.249555 0.267167 0.223093 0.241839 0.216355 0.244145 0.227984 0.219303
chargesum: 0.00000
title: Mulliken charges with hydrogens summed into heavy atoms:
elementType: I O C C C C C C C C C
charge: 0.095115 -0.156421 0.034032 0.263314 -0.453851 0.025348 -0.006551 0.095327 0.220476 -0.070544 -0.046245
polarizability: 1.51567115e+02 -5.21876475e+00 1.02465391e+02 -9.04468039e-01 1.18554118e+00 8.94479389e+01
1716.lowfreq: -21.3551 -7.1871 -0.0002 0.0002 0.0005 6.4538 64.3289 123.4586 156.8059
frequency: 64.1993 123.4525 156.7989 169.5553 194.1678 209.7212 225.9121 242.1065 276.1792 305.6880 357.1926 416.3302 435.1458 490.7928 529.9318 641.1257 686.8173 756.8973 775.5560 813.9989 817.3608 879.0905 902.7067 920.0043 941.3101 956.4962 963.4469 990.9684 994.3816 1027.5090 1042.8866 1067.3960 1094.1882 1141.4302 1155.3069 1203.2426 1208.0351 1221.9768 1234.1531 1241.5848 1274.9774 1284.0286 1305.6066 1373.0860 1392.9813 1455.3413 1463.2498 1471.4495 1473.6834 1480.2148 1487.9389 1501.6397 1674.4598 2981.8504 2984.5872 3018.7453 3030.7030 3038.8944 3063.9020 3076.7960 3078.9649 3081.8609 3087.7333 3092.6019 3099.9861 3112.7626
redmass: 4.4581 5.3745 1.1396 3.3574 2.3637 1.2873 4.7184 2.9890 3.3704 2.3171 2.2578 2.7115 2.2748 3.2447 3.6172 3.7107 5.4817 3.9814 4.9330 1.3587 2.7965 2.7602 2.7722 2.2959 1.6466 1.6883 2.2615 1.7117 1.4154 2.5841 1.6746 3.4586 1.1800 1.8439 2.2654 1.7315 2.1157 1.9552 1.3982 1.4588 1.6799 1.4939 1.5437 1.1799 1.1949 1.0526 1.0627 1.0735 1.0657 1.0674 1.0721 1.0729 12.0001 1.0351 1.0360 1.0610 1.0626 1.0616 1.0886 1.1011 1.1017 1.0990 1.1005 1.0995 1.1041 1.1052
irintensity: 1.5447 0.5698 0.2812 1.0817 1.0350 0.3729 2.0956 0.2065 4.0747 0.6520 0.3754 1.0129 0.9577 0.4780 2.2868 5.6718 6.4191 3.2855 64.6019 5.1579 1.0347 1.2287 9.8506 18.6790 12.0352 17.6379 3.6646 8.9213 7.1778 5.3855 5.8895 0.0277 10.3271 12.8893 2.0062 1.7535 0.5566 6.5150 1.6652 3.0564 3.5231 12.0657 1.5364 13.9921 19.0743 2.2289 3.0632 11.3871 3.0402 20.8194 20.9819 8.8485 136.0488 25.1052 28.9575 23.7113 34.6109 13.8848 41.9475 5.3073 15.8093 28.8057 11.3104 38.2227 31.4449 18.1977
temp: 298.150 k
press: 1.00000 atm
elementType: 53 8 6 6 6 6 6 6 6 6 6 1 1 1 1 1 1 1 1 1 1 1 1 1
symmnumber: 1
zpe: 521949.2 jmol-1
zpe.correction: 0.198800 hartree
zpe.thermalcorrener: 0.210007 hartree
zpe.thermalcorrenthalpy: 0.210951 hartree
zpe.thermalcorrgfe: 0.161098 hartree
zpe.sumelectzpe: -436.628062 hartree
zpe.sumelectthermal: -436.616856 hartree
zpe.sumelectthermalent: -436.615912 hartree
zpe.sumelectthermalfe: -436.665765 hartree
dipole: -3.2549 3.1040 1.5293
dipole: 4.7506
quadrupole: -76.3879 -83.7220 -81.1821
quadrupole: -0.6477 -0.8411 -3.7373
quadrupole: 4.0427 -3.2913 -0.7514 -0.6477 -0.8411 -3.7373
hfenergy: -436.8268624 hartree
pointgroup: C01 [X(C9H13I1O1)]
dipole: -0.9299854 1.5510122 0.471954 debye
dipolederiv: -0.4240822 0.1896243 -0.007835 0.1833136 -0.1557158 0.018629 -0.0299981 0.0257457 -0.0811533 -0.4343701 -0.019711 0.010322 -0.0967382 -0.7602899 -0.2589271 -0.0519331 -0.2745197 -0.3989724 0.0067275 -0.0138846 -0.0447753 0.0056811 0.0709679 0.031229 0.0037865 0.0303377 0.0417195 -0.2369975 0.1167081 0.1064604 0.0236653 0.039885 -0.0402311 0.1199241 -0.0546902 -0.0046434 0.6320673 -0.5446219 0.0151062 -0.652057 0.0191071 -0.1307349 0.0079471 -0.0664459 -0.0010864 -0.1778522 0.1050808 0.01347 0.0639585 0.040089 -0.0276466 -0.2027438 0.105514 0.0276997 0.0203993 0.0054732 0.0728544 -0.0015975 0.0447931 0.0580387 0.0483934 0.0516464 0.0238699 -0.1206656 0.0819407 -0.0420289 0.0107115 0.0225556 0.0550152 0.0682433 -0.08527 0.0905096 0.7676944 0.1042362 -0.0672745 0.434978 0.7265356 0.42912 0.0934783 0.3754178 0.2052612 0.0163406 -0.0304207 -0.0584019 -0.0074266 0.0036878 -0.0154905 0.00863 -0.0297842 -0.016602 0.0164893 -0.0187807 0.0091817 0.0739251 -0.0204557 0.0045493 -0.0563473 0.0327645 0.035398 -0.0824394 0.1054535 0.0999495 0.0715217 -0.0043616 -0.0611848 0.0721228 -0.0549852 -0.0033282 -0.0138133 -0.0957576 -0.0626944 -0.0934663 -0.0420754 -0.0739917 -0.0263685 -0.0346999 0.0619433 0.0823284 -0.0032833 0.0356028 -0.0026471 0.00023 0.1324467 0.0380345 0.080921 -0.049345 0.0039318 -0.0808805 -0.0147631 -0.0256416 -0.1523917 -0.0398627 -0.0033195 -0.0901314 0.0478131 -0.0395422 0.0910564 -0.0955607 0.0597339 0.0659964 0.019085 -0.0998316 0.0620298 -0.0658463 0.068895 0.0173579 -0.0253636 0.0345791 0.0526822 -0.0724076 -0.0014861 -0.0295487 -0.1048324 -0.060571 -0.0684873 0.0219949 -0.0875788 0.0114289 -0.0058183 -0.0126917 -0.0142896 0.0850015 0.0419314 -0.0459838 0.0975654 -0.0193684 0.0395535 0.1086049 0.0643131 0.092266 -0.0650183 0.0513931 -0.0459886 -0.0328937 -0.1167993 -0.0704453 -0.0703241 -0.0369516 -0.0241669 0.0799512 -0.0921361 0.1034016 0.0150415 0.127648 0.0251878 -0.0221167 0.0406465 -0.0414466 0.0499332 0.0615443 -0.048549 0.0106588 -0.0942164 -0.0791382 -0.0254215 -0.0298094 -0.0815112 0.061061 0.029389 0.0223552 -0.1353626 0.01625 0.0916549 0.0093542 -0.0870017 0.0334698 -0.0860316 -0.1166619 0.0736612 0.0787461 0.0915713 0.0305186 -0.0219143 0.0729626 -0.0086229 0.0666979 unknown
polarizability: 145.4104687|-16.9669483|108.6222912|2.4073369|-0.4233604|89.4476847 unknown
InChI: InChI=1S/C9H13IO/c1-8(2)6-3-4-9(10,5-6)7(8)11/h6H,3-5H2,1-2H3
charge 0 multiplicity 1
24 atoms
I  3.111076 -1.084362 0.22371
O  0.016249 -2.032857 -0.895375
C  -0.631897 1.189254 0.665856
C  -1.272378 -0.137926 0.113549
C  1.199763 -0.02944 0.069642
C  0.670598 0.664541 1.355881
C  -0.018777 2.028187 -0.497829
C  1.209838 1.158414 -0.959905
C  0.004075 -0.925479 -0.321412
C  -2.240247 0.018578 -1.083704
C  -2.003035 -0.930246 1.236444
H  -1.318318 1.756543 1.31543
H  1.338006 1.477097 1.688816
H  0.506938 -0.032738 2.192275
H  0.321497 3.007178 -0.116549
H  -0.733526 2.222424 -1.313151
H  1.13034 0.794171 -1.998009
H  2.160419 1.709195 -0.866539
H  -1.763258 0.488694 -1.960856
H  -2.600946 -0.975975 -1.399427
H  -3.113962 0.631706 -0.794071
H  -2.261689 -1.941498 0.876678
H  -1.392973 -1.040457 2.149276
H  -2.937291 -0.405202 1.509069
