program: Gaussian 09
title: 000285838
version: EM64L-G09RevD.01
frameworkgroup: C1[X(C19H18Br2O)]
method: RPBEPBE
basis: SDD
operation: Freq
keyword: #p
keyword: freq=noraman
keyword: PBEPBE/SDD
title: #p freq=noraman PBEPBE/SDD
converged: YES YES NO NO
title: Mulliken charges:
elementType: Br Br O C C C C C C C C C C C C C C C C C C C H H H H H H H H H H H H H H H H H H
charge: 0.091500 0.050151 -0.106385 0.036732 -0.494224 -0.384848 -0.404187 0.233451 -0.348524 -0.683824 0.427504 0.336464 -0.382067 -0.392042 -0.315800 -0.369650 -0.248318 -0.264146 -0.272985 -0.248193 -0.244094 -0.243816 0.224497 0.232396 0.227647 0.202456 0.232336 0.214642 0.254106 0.252771 0.251424 0.255735 0.233820 0.268242 0.224669 0.231746 0.226618 0.232916 0.228400 0.232880
chargesum: 0.00000
title: Mulliken charges with hydrogens summed into heavy atoms:
elementType: Br Br O C C C C C C C C C C C C C C C C C C C
charge: 0.091500 0.050151 -0.106385 0.036732 -0.037331 0.045256 0.042792 0.233451 0.158353 -0.683824 0.427504 0.336464 -0.130643 -0.136307 -0.081980 -0.101409 -0.023649 -0.032400 -0.046367 -0.015277 -0.015695 -0.010936
polarizability: 2.40313160e+02 1.03357734e+01 2.63333132e+02 9.13823454e-02 -9.00394440e+00 1.92811970e+02
1716.lowfreq: -7.1623 -0.0006 -0.0005 -0.0004 1.4780 10.9580 24.0868 29.4987 49.3537
frequency: 23.4316 29.1243 49.3376 56.5203 70.2428 84.6867 110.0279 140.0355 147.8307 159.1582 187.3893 194.7559 213.8089 239.5159 254.0096 270.0713 282.3345 300.9047 326.1702 342.4168 382.9246 402.4172 407.1389 429.3188 453.9559 486.6956 495.6085 538.1890 578.0226 597.6272 617.6895 617.7910 657.3365 659.9123 702.6229 709.6622 723.5017 745.5633 759.4395 782.0222 837.4587 846.3473 849.8604 861.8139 889.2954 907.5224 918.9290 929.4214 939.0840 962.7634 976.9695 986.6558 990.1490 990.9496 995.4839 999.8951 1029.3159 1032.6255 1046.2050 1055.6684 1076.1804 1091.3051 1099.2171 1116.2042 1140.4998 1155.1920 1171.8608 1174.3731 1176.8475 1199.8190 1202.2355 1211.3712 1238.0105 1273.5162 1304.0829 1324.4597 1334.7055 1336.6830 1346.6264 1362.9161 1372.2103 1374.5500 1378.7000 1433.0444 1436.0408 1441.0464 1464.8723 1471.3728 1477.8720 1481.9229 1488.3478 1586.9757 1590.9279 1597.7242 1607.9076 1612.3562 2980.6440 2991.6353 2994.9376 2999.3403 3035.6593 3047.0846 3058.3229 3066.2982 3115.1013 3126.2459 3126.6610 3135.3822 3140.0776 3147.6184 3155.2227 3156.1621 3167.2226 3168.2826
redmass: 9.3620 4.5109 5.4503 5.2283 5.3698 4.9153 8.3141 9.3571 6.8914 5.0990 5.2587 5.6842 6.1108 4.3416 3.8413 4.3519 3.2907 3.6994 3.6039 2.6790 3.6535 2.8245 2.8656 5.0186 2.2981 4.2367 3.2372 3.5957 5.1172 3.5172 6.3810 6.2991 5.2630 4.9254 1.7744 1.8355 6.3869 2.0956 1.9202 2.1437 2.1864 2.2038 1.2549 1.2564 2.4869 2.0680 2.2857 1.9692 1.6795 2.7127 1.3920 1.3983 4.7824 5.5739 1.4064 1.3247 2.5985 2.3868 3.3777 3.1788 1.9318 1.6884 1.8641 2.2063 2.6674 2.5076 2.0826 1.1845 1.0695 1.1180 1.8048 1.1936 1.2524 1.2730 1.1704 1.3496 1.3877 1.3441 1.2884 1.3675 1.8888 3.2957 5.4932 2.2410 2.1166 1.1168 1.0846 1.0904 1.2840 1.8699 1.7772 6.0338 6.0673 10.6415 5.9512 6.1851 1.0618 1.0628 1.0633 1.0626 1.0987 1.1005 1.0986 1.0981 1.0874 1.0864 1.0851 1.0876 1.0927 1.0923 1.0953 1.0957 1.0992 1.1008
irintensity: 0.1726 0.0953 0.1000 0.2732 0.6009 0.3461 0.3554 0.1465 1.6787 0.2440 0.3337 0.6539 1.2958 0.9428 0.3728 2.3043 0.9773 0.3384 4.1977 2.4876 8.2132 0.2130 0.6382 15.8059 12.3442 7.7892 6.6587 9.0738 55.9258 32.7585 0.3459 1.6468 17.8459 5.1975 47.6805 48.2903 30.7964 20.4456 54.6986 13.4230 6.4884 12.0061 0.3612 0.0851 12.8261 5.0963 32.3048 33.5461 3.3859 15.5413 0.0524 0.8612 0.8740 2.3780 0.0769 0.1401 2.8780 9.2942 3.5189 15.9956 7.0341 14.5025 0.2867 13.5372 6.7332 0.5262 3.3865 0.7708 0.1767 2.7227 4.7013 1.4837 2.9907 2.0120 0.5781 1.2393 1.5580 5.2114 1.7618 1.3234 2.0340 0.7822 1.8102 7.9706 7.4035 20.3155 9.3967 11.2052 13.3858 40.0877 12.5135 9.1907 1.1361 52.5226 7.5535 12.3734 11.6175 15.6505 42.2500 24.9425 16.5393 11.3224 38.4070 14.1080 7.8878 0.2545 1.6752 3.0647 24.3227 22.7106 17.2472 29.3665 18.3940 20.0442
temp: 298.150 k
press: 1.00000 atm
elementType: 35 35 8 6 6 6 6 6 6 6 6 6 6 6 6 6 6 6 6 6 6 6 1 1 1 1 1 1 1 1 1 1 1 1 1 1 1 1 1 1
symmnumber: 1
zpe: 825659.6 jmol-1
zpe.correction: 0.314477 hartree
zpe.thermalcorrener: 0.334658 hartree
zpe.thermalcorrenthalpy: 0.335603 hartree
zpe.thermalcorrgfe: 0.263784 hartree
zpe.sumelectzpe: -835.364514 hartree
zpe.sumelectthermal: -835.344333 hartree
zpe.sumelectthermalent: -835.343389 hartree
zpe.sumelectthermalfe: -835.415208 hartree
dipole: 2.2752 2.2771 3.8654
dipole: 5.0302
quadrupole: -144.6163 -136.0686 -147.4175
quadrupole: 1.2419 -2.9365 -2.0187
quadrupole: -1.9155 6.6322 -4.7167 1.2419 -2.9365 -2.0187
hfenergy: -835.6789913 hartree
pointgroup: C01 [X(C19H18Br2O1)]
dipole: 0.136222 -1.3132633 1.4742348 debye
polarizability: 235.1627622|-6.5476302|263.9460298|-14.1102142|11.1184586|197.3494691 unknown
InChI: InChI=1S/C19H18Br2O/c20-19(21)14-8-7-13-18(17(19)22,15-9-3-1-4-10-15)16-11-5-2-6-12-16/h1-6,9-12H,7-8,13-14H2
charge 0 multiplicity 1
40 atoms
Br 3.090235 1.688147 -2.199659
Br 1.847678 3.566045 0.214159
O  0.102174 1.473862 -1.746204
C  -0.094853 0.178302 0.316421
C  0.165287 0.503177 1.840335
C  1.503839 0.088135 2.489942
C  2.726583 0.922965 2.07456
C  0.657598 1.123684 -0.682122
C  3.063319 0.878406 0.567565
C  2.12288 1.612782 -0.401822
C  -1.62284 0.412126 0.091784
C  0.305287 -1.280373 -0.041735
C  -2.519258 -0.633664 -0.229695
C  0.069399 -2.32756 0.889964
C  -2.147137 1.720916 0.265543
C  0.825294 -1.629771 -1.315029
C  -3.905893 -0.382314 -0.359423
C  0.366092 -3.669783 0.572337
C  -3.527182 1.973961 0.137113
C  1.133543 -2.972956 -1.632398
C  -4.417938 0.919143 -0.173127
C  0.909116 -4.000513 -0.690854
H  -0.65431 0.010099 2.395934
H  0.005964 1.587578 1.990744
H  1.7088 -0.979957 2.291157
H  1.378939 0.180766 3.587299
H  2.602898 1.975276 2.390837
H  3.617412 0.53832 2.608489
H  4.06756 1.313693 0.42215
H  3.117663 -0.172799 0.219242
H  -2.144668 -1.648227 -0.392753
H  -0.366893 -2.10054 1.868377
H  -1.470534 2.557742 0.479082
H  0.981265 -0.86363 -2.081136
H  -4.581438 -1.206865 -0.614254
H  0.168906 -4.455962 1.309754
H  -3.906509 2.99355 0.268262
H  1.540314 -3.211691 -2.621274
H  -5.491213 1.113493 -0.277463
H  1.145421 -5.041262 -0.937997
