program: Gaussian 09
title: 000285828
version: EM64L-G09RevD.01
frameworkgroup: C1[X(C22H28O4)]
method: RPBEPBE
basis: SDD
operation: Freq
keyword: #pfreq=noraman
keyword: PBEPBE/SDD
title: #p freq=noraman PBEPBE/SDD
converged: YES YES NO NO
title: Mulliken charges:
elementType: O O O O C C C C C C C C C C C C C C C C C C C C C C H H H H H H H H H H H H H H H H H H H H H H H H H H H H
charge: -0.278701 -0.269124 -0.292342 -0.266487 0.173339 -0.365999 0.480748 -0.780718 -0.714001 -0.717384 -0.403119 -0.391112 -0.383659 -0.406774 0.349135 -0.311764 -0.323157 0.365964 -0.333121 -0.366767 0.226419 -0.357155 -0.313690 0.186701 -0.258067 -0.665547 0.194422 0.194307 0.216826 0.224405 0.214867 0.206744 0.214901 0.222580 0.211576 0.217666 0.234424 0.224495 0.248797 0.245924 0.245602 0.221885 0.222989 0.228898 0.227797 0.255346 0.252975 0.269401 0.272919 0.234539 0.219883 0.215664 0.225510 0.251043
chargesum: 0.00000
title: Mulliken charges with hydrogens summed into heavy atoms:
elementType: O O O O C C C C C C C C C C C C C C C C C C C C C C
charge: -0.278701 -0.269124 -0.292342 -0.266487 0.173339 0.022730 0.480748 -0.124621 -0.069777 -0.053718 -0.178624 -0.142315 -0.137735 -0.161172 0.349135 0.133110 0.133537 0.365964 -0.077775 -0.113792 0.226419 -0.087754 -0.040771 0.186701 0.196355 0.026670
polarizability: 4.25324600e+02 -1.29249349e+00 2.29544743e+02 -4.20565897e+00 7.20280345e+00 1.54551383e+02
1716.lowfreq: -4.7640 -0.0016 -0.0012 0.0020 1.7437 8.9122 11.0135 20.7510 27.5087
frequency: 10.6770 20.5865 26.2886 31.7506 45.6615 50.4067 58.9114 76.8828 82.5588 94.0767 109.8639 118.9049 132.7279 148.7969 151.8096 163.4707 190.1228 213.5986 223.9601 229.7825 242.6499 259.1373 273.1399 294.2067 313.8362 317.0560 333.7632 347.1048 351.9454 372.2407 406.7837 413.5906 416.8949 433.3995 456.9037 473.4826 480.8815 495.7230 506.7284 535.9995 555.9801 619.1638 628.4740 635.8418 657.3683 675.9715 733.8821 735.0585 753.3752 768.8163 785.3309 810.1781 813.3397 819.2054 825.2617 828.7306 836.6361 844.6922 850.2634 860.3344 908.2916 932.4475 943.1404 964.6561 977.4588 986.8368 987.9004 989.3467 996.0042 999.2877 1002.6588 1009.7738 1010.8807 1050.0622 1060.5565 1065.9763 1096.2710 1106.3063 1107.3884 1114.4016 1116.8441 1125.2219 1154.5325 1169.7591 1173.7702 1175.7047 1186.5771 1210.2884 1225.6592 1235.0428 1236.6937 1254.3703 1271.5715 1281.2038 1300.6918 1301.8957 1310.5390 1326.5309 1327.4435 1358.7083 1363.1404 1373.4713 1378.4054 1391.5685 1392.0091 1394.0139 1402.4876 1413.2555 1426.9425 1455.5028 1460.3151 1464.0816 1466.1273 1472.7779 1478.9039 1480.2464 1484.4810 1484.5588 1487.6987 1489.2613 1497.5105 1498.9429 1502.7827 1574.8764 1582.6714 1614.7312 1620.0874 1622.2868 2967.3180 2969.9649 2973.0617 2978.2553 2983.3550 2984.2055 2992.1595 3017.4330 3028.1014 3031.1438 3061.4432 3063.8492 3068.7906 3072.0518 3074.9251 3078.4424 3083.0734 3086.6822 3092.1889 3117.6297 3125.5984 3147.4235 3151.1544 3157.3889 3160.2815 3169.1702 3171.0625 3183.5377
redmass: 5.1761 4.4590 4.1777 4.9574 3.2437 3.3365 3.9960 4.2127 5.1942 4.4229 2.9844 4.3863 2.9035 4.6262 1.8876 3.6756 2.0630 1.9995 1.1235 1.7520 1.3521 2.6075 4.4438 4.9743 1.5274 1.8317 3.5877 2.7441 3.3898 3.6874 4.2141 2.9451 2.9893 3.6249 3.7732 3.1518 3.4045 4.4093 2.9688 3.5828 2.3578 6.2910 7.0520 6.8453 5.2961 4.2103 3.3461 3.3844 4.6074 1.6328 2.6601 2.0930 1.3388 1.7416 1.2796 3.0255 1.5755 3.6038 1.4860 1.2402 1.9287 1.5427 1.3563 1.3515 1.3560 1.3510 4.0928 1.4770 3.5038 6.2355 2.7947 2.4538 1.6119 1.5682 4.5972 2.2230 2.1515 1.4506 2.7277 2.0948 1.3220 1.5227 1.6528 2.7078 1.2482 1.1228 1.3404 2.5490 2.7088 2.2305 2.6655 3.8247 1.1417 1.1159 1.2910 1.5483 1.3670 1.4211 1.3037 1.3022 4.3421 1.2379 4.5232 1.2218 1.2344 1.2058 1.6446 3.3798 4.2650 1.1043 1.0605 1.0433 1.0651 1.0682 1.1371 1.0486 1.0605 1.0575 1.2955 1.0573 1.0578 1.9362 2.0359 7.7790 7.0449 7.8968 6.8806 6.9533 1.0496 1.0435 1.0560 1.0360 1.0368 1.0547 1.0362 1.1007 1.0592 1.1066 1.1106 1.0998 1.0998 1.0991 1.0994 1.0988 1.0998 1.0976 1.1033 1.1056 1.0875 1.0871 1.0881 1.0941 1.0887 1.0960 1.0959 1.0969
irintensity: 0.0037 0.0226 0.1335 0.0487 0.0771 0.2219 2.9544 0.1206 0.1744 0.3737 0.6131 0.4873 0.3912 11.8807 0.1848 1.2183 0.4723 3.2087 0.3460 1.1605 0.0310 0.6945 2.6453 4.2363 5.4494 6.6821 3.5570 1.1687 1.0503 1.8997 3.3604 0.0265 0.0216 0.0665 6.9508 2.6397 1.4438 2.6577 7.2127 4.0743 19.1291 27.1907 10.4359 7.9923 8.3359 26.2094 15.0508 4.3187 17.3792 22.2396 10.1803 3.1697 23.4543 2.3992 2.9889 2.8605 44.3762 4.5812 35.7793 21.7111 5.3143 0.9109 0.3833 0.1932 1.0892 0.2054 84.5312 12.6307 4.0250 56.7163 104.7290 65.8162 17.8287 2.7771 366.0672 4.4992 24.5198 0.0055 0.4024 7.1695 13.4451 7.1300 100.2417 13.6648 255.6023 10.5148 119.7425 2.5755 483.5014 21.0821 5.7292 438.5415 0.3707 0.9980 2.5430 28.5602 1.6005 2.8350 3.6583 13.5899 5.0612 20.9233 44.1028 26.4761 24.3399 9.4240 1.2478 0.8482 2.0336 37.4047 0.2921 15.2065 6.2715 13.1260 7.5133 3.6775 31.6364 13.4593 177.3575 11.3342 9.7294 34.4344 94.9398 1.2935 5.5779 431.2364 71.1741 45.8275 7.8450 69.6299 17.6879 30.7528 29.4178 39.5777 24.4226 26.1143 39.8172 3.8327 54.4271 19.8939 39.0811 24.3867 72.9861 60.2315 54.0100 41.2954 2.3993 32.4927 22.8824 9.0772 3.5178 19.9985 2.9635 7.1468 12.6772 3.2441
temp: 298.150 k
press: 1.00000 atm
elementType: 8 8 8 8 6 6 6 6 6 6 6 6 6 6 6 6 6 6 6 6 6 6 6 6 6 6 1 1 1 1 1 1 1 1 1 1 1 1 1 1 1 1 1 1 1 1 1 1 1 1 1 1 1 1
symmnumber: 1
zpe: 1179875.2 jmol-1
zpe.correction: 0.449391 hartree
zpe.thermalcorrener: 0.476530 hartree
zpe.thermalcorrenthalpy: 0.477474 hartree
zpe.thermalcorrgfe: 0.388606 hartree
zpe.sumelectzpe: -1154.076951 hartree
zpe.sumelectthermal: -1154.049812 hartree
zpe.sumelectthermalent: -1154.048868 hartree
zpe.sumelectthermalfe: -1154.137736 hartree
dipole: 1.7500 -1.9023 -0.4283
dipole: 2.6201
quadrupole: -139.9094 -151.8491 -160.4764
quadrupole: 12.7347 1.9960 0.3643
quadrupole: 10.8356 -1.1041 -9.7315 12.7347 1.9960 0.3643
hfenergy: -1154.5263421 hartree
pointgroup: C01 [X(C22H28O4)]
dipole: -0.7224612 0.0840453 -0.73045 debye
polarizability: 425.1020262|4.8233223|158.373895|-6.1383194|-18.0754897|225.9448049 unknown
InChI: InChI=1S/C22H28O4/c1-5-22(3,4)18-9-13-20(14-10-18)26-16-15-25-19-11-7-17(8-12-19)21(23)24-6-2/h7-14H,5-6,15-16H2,1-4H3
charge 0 multiplicity 1
54 atoms
O  -1.71875 -0.669143 0.975182
O  1.519381 -0.155345 -0.623523
O  7.872145 0.308398 -0.951881
O  7.740123 -0.334001 1.291209
C  -7.471606 -0.592342 0.111428
C  -7.917407 0.759619 -0.548494
C  -5.941693 -0.600776 0.34339
C  -8.267888 -0.80826 1.424496
C  -7.838598 -1.752199 -0.865312
C  -7.624858 2.031292 0.276182
C  -5.055326 -0.362808 -0.739462
C  -5.353805 -0.85752 1.611298
C  -3.652287 -0.372999 -0.582499
C  -3.956186 -0.877202 1.792137
C  -3.100498 -0.633045 0.695035
C  -0.800374 -0.385411 -0.131572
C  0.597573 -0.477485 0.47746
C  2.892229 -0.153103 -0.352888
C  3.458004 -0.459776 0.912037
C  3.725512 0.184496 -1.450965
C  5.700297 -0.087324 -0.024076
C  4.857237 -0.424765 1.064142
C  5.118295 0.217375 -1.286001
C  7.168773 -0.064481 0.202624
C  9.360045 0.344222 -0.834885
C  9.959949 -1.038596 -1.106628
H  -9.005901 0.692218 -0.752618
H  -7.426286 0.85278 -1.537574
H  -9.351716 -0.754575 1.212394
H  -8.036181 -0.043984 2.187419
H  -8.063206 -1.802978 1.861946
H  -8.929228 -1.767258 -1.053393
H  -7.327383 -1.639637 -1.838613
H  -7.546121 -2.730248 -0.441409
H  -7.921369 2.935829 -0.286328
H  -8.181041 2.039093 1.230931
H  -6.547939 2.1145 0.508968
H  -5.458967 -0.159833 -1.738454
H  -5.98961 -1.046052 2.4813
H  -3.013145 -0.180653 -1.449829
H  -3.513304 -1.075786 2.773239
H  -0.91849 -1.128517 -0.944785
H  -0.976246 0.629291 -0.540221
H  0.708281 0.250821 1.30385
H  0.789213 -1.498198 0.860816
H  2.828245 -0.72173 1.766863
H  3.258001 0.415568 -2.412643
H  5.319375 -0.657487 2.0292
H  5.769912 0.478453 -2.123891
H  9.624642 0.702996 0.1753
H  9.662956 1.083235 -1.594227
H  11.064116 -0.974209 -1.101266
H  9.64093 -1.419926 -2.09213
H  9.652976 -1.756838 -0.32818
