program: Gaussian 09
title: 000285779
version: EM64L-G09RevD.01
frameworkgroup: C1[X(C15H11NO2)]
method: RPBEPBE
basis: SDD
operation: Freq
keyword: #p
keyword: freq=noraman
keyword: PBEPBE/SDD
title: #p freq=noraman PBEPBE/SDD
converged: NO YES NO NO
title: Mulliken charges:
elementType: O O N C C C C C C C C C C C C C C C H H H H H H H H H H H
charge: -0.185539 -0.219160 -0.320052 -0.072193 0.224505 0.351378 0.297108 0.111121 -0.393408 -0.393216 -0.365210 -0.402475 -0.234240 -0.241303 -0.224258 -0.223166 -0.249031 -0.235663 0.326626 0.250701 0.267949 0.272275 0.262233 0.227247 0.228047 0.237685 0.235452 0.229320 0.237270
chargesum: 0.00000
title: Mulliken charges with hydrogens summed into heavy atoms:
elementType: O O N C C C C C C C C C C C C C C C
charge: -0.185539 -0.219160 0.006574 -0.072193 0.224505 0.351378 0.297108 0.111121 -0.142707 -0.125267 -0.092935 -0.140242 -0.006993 -0.013257 0.013427 0.012286 -0.019711 0.001607
polarizability: 2.50276742e+02 -1.23100584e+00 1.93337841e+02 2.00751927e+01 -4.42670088e+00 9.81980127e+01
1716.lowfreq: -10.8070 -6.8788 -3.9699 0.0004 0.0006 0.0007 40.3899 49.1335 63.6310
frequency: 40.3654 49.0823 63.6254 85.3521 107.0056 141.4048 195.6936 252.8086 261.9057 315.0108 323.7862 360.6887 400.0765 402.0460 405.4466 485.9557 493.9119 517.6029 571.7474 606.7586 615.1044 624.0815 637.7615 675.8833 696.2482 700.2025 703.5820 718.8159 771.3167 777.3468 831.9295 849.9011 860.8385 909.3733 922.6200 934.5254 976.3981 982.9617 986.9848 988.7018 989.2237 995.2812 1004.2840 1023.7279 1027.5285 1064.8741 1084.2590 1084.3992 1160.5327 1174.4234 1176.8446 1193.0483 1199.5550 1275.0554 1316.5387 1321.9129 1327.7728 1372.9504 1377.0660 1402.7260 1434.2967 1440.9098 1475.3835 1496.0480 1573.3761 1582.0477 1592.9108 1614.2703 1614.8620 1712.3848 3125.1491 3131.4208 3135.4028 3138.8761 3149.5460 3150.3244 3160.6576 3161.0473 3172.0548 3172.7640 3505.1759
redmass: 3.8713 4.5493 5.2595 5.7581 5.7364 5.8373 5.6682 6.3456 5.0640 6.4329 6.8762 4.7625 6.7686 2.9518 2.8922 2.6768 2.7787 2.7919 3.6351 7.0191 6.4664 7.7061 7.6446 6.7783 4.8825 2.1282 1.9234 4.6449 1.8420 2.1405 5.4887 1.2759 1.2441 6.5878 1.5068 1.4082 1.3904 2.4801 2.6131 4.9772 3.3511 1.3831 1.3358 2.9282 2.2341 2.8929 1.6513 1.6868 3.5264 1.0752 1.0550 1.1189 1.1243 2.4926 1.7654 1.4421 1.4081 5.2844 6.3351 3.0261 2.3155 2.3661 2.2424 2.7640 6.3132 5.9455 7.5115 5.9809 6.3742 12.5829 1.0848 1.0856 1.0886 1.0884 1.0935 1.0929 1.0971 1.0965 1.0989 1.1013 1.0802
irintensity: 0.4333 0.0972 1.1669 1.2876 1.8149 1.5091 0.2359 2.4903 1.6064 2.2126 2.6281 3.7499 8.7597 1.8668 0.1015 58.5180 77.7420 91.2605 57.2843 5.0069 0.2374 5.4925 19.2120 7.8257 14.5670 51.8703 34.9139 4.2727 86.9569 25.6334 106.5410 1.3488 0.8052 2.1909 4.1653 7.5054 1.3023 6.1253 0.3366 0.2569 3.0070 0.1880 0.3536 0.9609 9.9475 18.1225 1.2280 16.9662 2.8545 0.0875 0.0673 2.6337 1.4336 35.7746 15.0298 4.3239 3.5273 4.2936 0.6160 38.1901 15.0928 15.9712 16.2874 27.6572 22.2736 5.2272 33.0883 12.6798 10.3788 478.1146 1.1862 1.2921 8.2104 1.1979 29.7905 17.4099 21.3362 18.4713 11.7263 13.8520 47.3576
temp: 298.150 k
press: 1.00000 atm
elementType: 8 8 7 6 6 6 6 6 6 6 6 6 6 6 6 6 6 6 1 1 1 1 1 1 1 1 1 1 1
symmnumber: 1
zpe: 576335.5 jmol-1
zpe.correction: 0.219515 hartree
zpe.thermalcorrener: 0.233720 hartree
zpe.thermalcorrenthalpy: 0.234664 hartree
zpe.thermalcorrgfe: 0.177382 hartree
zpe.sumelectzpe: -782.126454 hartree
zpe.sumelectthermal: -782.112249 hartree
zpe.sumelectthermalent: -782.111305 hartree
zpe.sumelectthermalfe: -782.168587 hartree
dipole: -5.6476 -3.5834 0.8449
dipole: 6.7416
quadrupole: -94.5429 -106.2553 -103.1382
quadrupole: -12.6800 3.5330 0.6856
quadrupole: 6.7692 -4.9432 -1.8261 -12.6800 3.5330 0.6856
hfenergy: -782.3459688 hartree
pointgroup: C01 [X(C15H11N1O2)]
dipole: 2.2760611 1.3581056 -0.1006893 debye
polarizability: 235.5367756|-0.0325779|193.0218291|-49.1120383|7.8617555|113.2539904 unknown
InChI: InChI=1S/C15H11NO2/c17-15-13(11-7-3-1-4-8-11)14(16-18-15)12-9-5-2-6-10-12/h1-10,16H
charge 0 multiplicity 1
29 atoms
O  -0.342718 -3.266663 -0.010177
O  -2.531241 -2.650427 0.601793
N  0.828782 -2.505004 -0.377291
C  -0.755314 -0.941201 0.153616
C  0.590762 -1.142926 -0.169812
C  -1.514336 0.320662 0.270274
C  1.74249 -0.226773 -0.3011
C  -1.391128 -2.253022 0.310009
C  -1.169072 1.467925 -0.500055
C  -2.640129 0.400267 1.138333
C  1.906078 0.860213 0.600336
C  2.734048 -0.464262 -1.292885
C  -1.907998 2.662821 -0.384717
C  -3.377697 1.598181 1.24912
C  3.037289 1.695124 0.504556
C  3.865625 0.375027 -1.382965
C  -3.014322 2.73715 0.49457
C  4.020765 1.456604 -0.485663
H  1.685217 -2.975643 -0.065144
H  -0.332848 1.416938 -1.20506
H  -2.939919 -0.481246 1.712634
H  1.15096 1.041555 1.371538
H  2.598004 -1.284044 -2.007413
H  -1.629392 3.532112 -0.991045
H  -4.24086 1.639513 1.922709
H  3.154842 2.529389 1.204245
H  4.61918 0.190074 -2.155993
H  -3.59054 3.665029 0.580569
H  4.897872 2.108828 -0.557382
