program: Gaussian 09
title: 000285804
version: EM64L-G09RevD.01
frameworkgroup: C1[X(C21H18N6)]
method: RPBEPBE
basis: SDD
operation: Freq
keyword: #pfreq=noraman
keyword: PBEPBE/SDD
title: #p freq=noraman PBEPBE/SDD
converged: YES YES NO NO
title: Mulliken charges:
elementType: N N N N N N C C C C C C C C C C C C C C C C C C C C C H H H H H H H H H H H H H H H H H H
charge: -0.070699 -0.070535 -0.040867 -0.079997 -0.078651 -0.273357 -0.407715 -0.401363 -0.408769 -0.400625 -0.080750 -0.070489 -0.015808 0.198186 0.135308 0.196120 -0.363142 -0.375872 0.425738 -0.342117 -0.254504 -0.238671 -0.394201 -0.366764 -0.217562 -0.218551 -0.243852 0.239592 0.245150 0.247159 0.240372 0.240757 0.246453 0.247452 0.240808 0.299438 0.289903 0.254097 0.221737 0.221168 0.271015 0.257278 0.231886 0.231653 0.233590
chargesum: 0.00000
title: Mulliken charges with hydrogens summed into heavy atoms:
elementType: N N N N N N C C C C C C C C C C C C C C C C C C C C C
charge: -0.070699 -0.070535 -0.040867 -0.079997 -0.078651 -0.273357 0.077027 0.086169 0.078441 0.087634 -0.080750 -0.070489 -0.015808 0.198186 0.135308 0.196120 -0.063704 -0.085969 0.425738 -0.088021 -0.032767 -0.017502 -0.123186 -0.109486 0.014324 0.013103 -0.010262
polarizability: 4.35594464e+02 -1.47534752e+01 3.44409852e+02 -6.34034377e+00 -1.74820204e+01 1.37144524e+02
1716.lowfreq: -0.0004 0.0000 0.0004 2.8025 4.4574 7.0772 21.0706 40.2780 44.4771
frequency: 20.9412 40.2709 44.4618 59.5298 65.8153 73.3540 80.4077 95.7167 116.5705 125.0496 150.2364 164.0397 185.6863 211.0227 224.0923 232.1953 239.0654 248.5217 283.9842 301.6934 370.3578 395.8410 410.6321 417.4685 433.5030 462.5007 475.7259 493.2532 552.1778 581.0456 585.7538 603.8968 617.3563 620.6297 652.7312 695.8929 700.6397 704.0060 711.0896 754.1901 758.0885 764.5707 771.1345 774.6102 779.6265 791.7856 792.5325 805.9666 844.0877 860.3865 872.5933 883.5806 905.8233 916.2857 921.9963 932.2045 940.2047 951.6937 973.9228 986.0002 988.5211 991.8424 993.3706 996.9322 1009.4769 1015.9857 1024.5228 1041.4498 1081.7787 1093.3119 1095.9487 1101.1656 1103.7914 1106.8199 1120.1152 1122.4013 1136.0331 1136.6596 1138.4832 1166.5565 1173.8188 1184.2605 1188.8028 1213.8706 1217.7887 1222.5784 1224.5789 1286.0871 1292.4553 1326.7928 1355.7803 1380.7884 1393.8275 1407.4299 1418.9748 1445.3112 1448.4724 1451.5563 1463.9017 1466.4498 1471.2443 1479.7500 1481.5045 1485.5095 1495.7926 1513.5516 1580.0347 1582.4673 1594.9711 1611.8286 1624.8060 3077.0759 3077.2746 3084.5182 3085.0889 3128.8056 3131.7584 3139.5849 3147.0921 3153.0086 3161.3544 3166.1848 3173.1619 3179.8660 3179.9993 3182.8538 3195.7311 3195.7385 3245.8631
redmass: 5.2430 4.6548 4.8354 4.3846 3.3265 3.8104 3.9650 4.3802 4.6212 4.1431 2.9122 4.1939 5.2580 5.3663 5.1756 5.0169 4.4963 5.4060 5.1146 5.5170 5.7288 5.7922 2.9200 4.8762 3.1110 6.4712 6.2591 3.8308 6.5248 4.1355 4.7875 4.7611 7.0376 5.6903 6.1688 5.2630 2.9626 4.8082 5.3629 3.7253 1.4172 2.7090 4.4750 3.1636 4.4432 1.0864 1.0656 6.0939 1.2564 1.5329 1.3911 5.6791 6.6311 1.5988 4.6534 5.3798 5.6004 1.3592 1.3975 1.8040 5.3434 1.3176 1.3023 1.1579 1.4928 2.0542 2.3667 3.2891 1.5726 1.3796 1.3218 1.3285 1.3292 1.8367 1.5614 1.5179 1.4815 1.4792 1.5657 1.1996 1.0522 1.8200 1.3558 6.2335 4.8918 2.3476 4.5796 2.4990 2.3242 1.4533 4.0042 6.9807 4.0779 7.0961 4.7269 2.4203 3.8888 4.1247 1.0766 1.0790 9.5480 3.0877 1.2372 1.3072 3.4336 7.9169 6.8741 8.7969 6.7567 6.2489 7.5278 1.0482 1.0483 1.0604 1.0604 1.0858 1.0850 1.0886 1.0913 1.0932 1.0966 1.0967 1.1008 1.1188 1.1189 1.0962 1.1176 1.1176 1.0981
irintensity: 0.1172 0.8240 0.6534 1.8972 5.2000 0.0663 7.5128 2.1963 2.5712 5.0617 0.7915 0.4502 0.6897 3.7210 4.1039 15.1538 9.7956 7.1405 25.5070 1.5639 1.7027 3.9057 2.1016 3.0899 8.0087 9.1681 0.1185 9.5695 1.4906 4.0926 6.2536 2.6312 24.0735 3.0647 5.8514 5.1050 38.1301 13.1615 8.7006 0.5807 61.0631 88.9339 12.6931 8.2729 14.2698 53.1837 29.0410 12.4160 1.6049 9.2745 1.1436 17.5230 7.5823 4.5498 2.6485 0.6722 19.9000 2.0737 0.6485 27.8366 0.0640 0.6861 0.5625 1.8496 8.6888 23.0697 11.0728 3.2020 12.1276 1.6919 5.5636 4.5272 6.0055 9.4180 47.7517 41.8410 1.7543 9.7425 23.4632 3.5929 0.2958 4.9747 0.1983 82.2949 15.8363 143.9068 173.8211 30.0280 79.4989 17.1429 72.4922 24.7717 77.5481 211.8056 31.1059 19.0644 474.3676 399.4978 6.0536 5.2589 1418.2813 370.7034 33.5483 3.7189 153.8929 825.1164 15.5959 96.7193 4.2123 63.7566 14.6325 13.1132 19.0979 70.6586 39.0422 3.4494 4.3529 5.2356 30.5431 26.6618 12.7302 16.9814 15.2105 1.2798 1.1817 12.1420 25.5999 38.4078 4.3486
temp: 298.150 k
press: 1.00000 atm
elementType: 7 7 7 7 7 7 6 6 6 6 6 6 6 6 6 6 6 6 6 6 6 6 6 6 6 6 6 1 1 1 1 1 1 1 1 1 1 1 1 1 1 1 1 1 1
symmnumber: 1
zpe: 915643.0 jmol-1
zpe.correction: 0.348750 hartree
zpe.thermalcorrener: 0.370799 hartree
zpe.thermalcorrenthalpy: 0.371743 hartree
zpe.thermalcorrgfe: 0.295949 hartree
zpe.sumelectzpe: -1137.600784 hartree
zpe.sumelectthermal: -1137.578736 hartree
zpe.sumelectthermalent: -1137.577792 hartree
zpe.sumelectthermalfe: -1137.653586 hartree
dipole: 1.1806 -1.4602 0.1093
dipole: 1.8810
quadrupole: -123.3281 -135.0621 -158.0369
quadrupole: -6.2433 -3.2196 2.0831
quadrupole: 15.4809 3.7469 -19.2278 -6.2433 -3.2196 2.0831
hfenergy: -1137.9495344 hartree
pointgroup: C01 [X(C21H18N6)]
dipole: -0.4884831 0.5354905 0.1493028 debye
polarizability: 435.9288974|-14.7808804|325.7389999|12.6256186|60.1094478|155.4809431 unknown
InChI: InChI=1S/C21H18N6/c1-2-6-15(7-3-1)27-14-17(16-8-4-5-9-18(16)27)19-22-20(25-10-11-25)24-21(23-19)26-12-13-26/h1-9,14H,10-13H2
charge 0 multiplicity 1
45 atoms
N  3.119988 2.966798 1.013912
N  4.496031 -1.305232 -0.39489
N  3.86158 0.84411 0.318916
N  2.19075 -0.867552 -0.189478
N  1.481567 1.387275 0.403544
N  -2.459971 -0.115347 -0.078293
C  2.611438 4.251897 0.494225
C  4.111388 3.900458 0.443034
C  4.658678 -2.694061 0.078626
C  5.708306 -1.608625 0.390437
C  2.80752 1.696036 0.544059
C  3.482264 -0.417403 -0.057532
C  1.221388 0.080413 0.045412
C  -0.17589 -0.31043 -0.086904
C  -0.738384 -1.596971 -0.480432
C  -2.168488 -1.45368 -0.465707
C  -1.253201 0.549729 0.151019
C  -0.170115 -2.849849 -0.824013
C  -3.755266 0.481177 0.06882
C  -3.035645 -2.532408 -0.743271
C  -1.031101 -3.923427 -1.125843
C  -2.446317 -3.769786 -1.076384
C  -4.769901 0.246043 -0.892768
C  -4.010638 1.335162 1.171387
C  -6.032968 0.857145 -0.741951
C  -5.272238 1.952487 1.305087
C  -6.291199 1.712785 0.353999
H  2.24463 4.961507 1.242337
H  2.046467 4.225825 -0.445177
H  4.545353 3.638459 -0.529136
H  4.802389 4.361512 1.155443
H  4.865151 -3.443108 -0.6921
H  4.006873 -3.026969 0.895166
H  5.7537 -1.215666 1.412989
H  6.653997 -1.593404 -0.160038
H  -1.219912 1.599329 0.431493
H  0.917502 -2.952045 -0.842037
H  -4.123014 -2.429553 -0.687122
H  -0.608463 -4.897919 -1.394979
H  -3.09153 -4.627568 -1.29694
H  -4.55869 -0.377389 -1.766777
H  -3.232545 1.495194 1.925294
H  -6.810912 0.675368 -1.491518
H  -5.462783 2.609703 2.16046
H  -7.271792 2.187576 0.464331
