program: Gaussian 09
title: 000285765
version: EM64L-G09RevD.01
frameworkgroup: C1[X(C13H14N2O2)]
method: RPBEPBE
basis: SDD
operation: Freq
keyword: #p
keyword: freq=noraman
keyword: PBEPBE/SDD
title: #p freq=noraman PBEPBE/SDD
converged: YES YES NO NO
title: Mulliken charges:
elementType: O O N N C C C C C C C C C C C C C H H H H H H H H H H H H H H
charge: -0.286576 -0.278895 -0.254415 -0.035956 -0.338163 -0.466008 -0.516629 0.116538 0.179339 0.011646 0.146704 -0.356775 -0.355711 -0.223251 0.186120 -0.220016 -0.674332 0.253513 0.253493 0.237745 0.237662 0.252556 0.252464 0.254768 0.268486 0.229408 0.227081 0.226966 0.211450 0.230367 0.230420
chargesum: 0.00000
title: Mulliken charges with hydrogens summed into heavy atoms:
elementType: O O N N C C C C C C C C C C C C C
charge: -0.286576 -0.278895 -0.254415 -0.035956 0.168844 0.009399 -0.011609 0.116538 0.179339 0.011646 0.146704 -0.102007 -0.087225 0.006157 0.186120 0.234031 -0.002094
polarizability: 2.18453657e+02 7.74796002e+00 1.88612898e+02 -7.29060212e-02 6.67801300e-02 8.33678825e+01
1716.lowfreq: -98.9162 -6.6688 -2.1015 -0.0009 -0.0005 0.0002 9.1205 19.9498 56.6531
frequency: -98.8516 19.7872 56.6291 65.6411 90.3219 114.5670 133.6494 186.1412 186.9221 254.2994 268.9272 278.9587 299.2119 304.3210 365.7922 423.0337 482.1711 505.7755 569.2140 582.0346 597.0189 640.3931 676.6982 715.5367 722.2205 756.2397 765.6934 771.1042 795.3306 797.5086 820.3732 828.1340 905.9770 906.2606 933.9337 942.2434 959.7055 982.9734 1029.7467 1032.9784 1061.6822 1070.2045 1089.0926 1112.5886 1130.2356 1135.7418 1166.8991 1196.3430 1212.1058 1227.1142 1238.5487 1246.7835 1251.9612 1265.6092 1268.8010 1307.7028 1329.2146 1358.7571 1361.2504 1387.3592 1400.2164 1448.8394 1463.8993 1464.4239 1473.3007 1477.0742 1484.2881 1487.1163 1496.1963 1533.0970 1585.6366 1595.9874 1624.0992 2995.1376 3007.4321 3014.0776 3034.3197 3051.6808 3060.8161 3065.6461 3088.6919 3091.7924 3106.9383 3115.6986 3143.8273 3167.7397 3182.8997
redmass: 1.6168 3.3549 5.3310 2.7508 3.8955 3.0052 2.8532 3.5252 4.7027 1.2655 5.8906 4.8189 5.3610 4.5408 4.1740 4.9932 4.7854 6.5243 5.9151 3.8619 6.2124 4.5937 6.9222 6.8425 7.2286 1.8926 1.1667 6.8058 5.4260 1.1081 2.4312 4.0684 1.4018 3.2050 1.3965 5.8254 4.5982 1.3433 2.6643 3.3585 2.1158 1.6854 4.7380 2.2291 2.2547 1.4625 1.2384 1.8987 1.1153 2.3479 1.0748 1.1358 2.2756 2.4969 1.6761 1.5877 3.0977 1.6155 2.0700 2.7001 1.2721 5.0836 1.0405 1.0831 1.0625 3.2815 1.1183 1.0833 1.0999 9.5367 8.0558 10.3747 8.7581 1.0359 1.0580 1.0600 1.0608 1.0611 1.1036 1.1066 1.1057 1.0985 1.1025 1.1063 1.0872 1.0942 1.0959
irintensity: 1.0879 0.6470 2.4916 0.0002 0.6121 9.2282 0.2672 0.2888 6.0614 0.6420 0.2076 0.2198 10.4375 0.7079 14.7647 0.9964 3.3992 0.4052 0.4937 0.0046 7.4313 0.1965 1.3377 7.4232 16.6040 52.0733 1.5959 1.7127 1.0751 2.1561 23.0175 2.4353 0.8236 1.2725 0.0888 12.1108 72.6111 1.5114 91.2093 0.0239 83.2330 0.0013 179.6621 3.1999 83.0197 5.2793 0.3327 132.9136 0.3327 52.5684 0.1626 0.0027 288.0574 12.1762 58.2022 11.4584 8.0652 14.6429 20.1846 17.8412 21.2206 19.1298 12.1985 6.7096 7.8123 25.7600 9.9785 8.5406 5.3530 53.6956 62.1673 130.6157 88.6666 23.3606 21.5882 19.3265 38.0067 29.0464 2.5746 9.6665 8.0263 30.7968 43.7653 31.5989 8.1758 9.4018 8.0554
temp: 298.150 k
press: 1.00000 atm
elementType: 8 8 7 7 6 6 6 6 6 6 6 6 6 6 6 6 6 1 1 1 1 1 1 1 1 1 1 1 1 1 1
symmnumber: 1
zpe: 651045.7 jmol-1
zpe.correction: 0.247970 hartree
zpe.thermalcorrener: 0.262231 hartree
zpe.thermalcorrenthalpy: 0.263175 hartree
zpe.thermalcorrgfe: 0.205177 hartree
zpe.sumelectzpe: -762.526170 hartree
zpe.sumelectthermal: -762.511909 hartree
zpe.sumelectthermalent: -762.510965 hartree
zpe.sumelectthermalfe: -762.568963 hartree
dipole: 1.5869 -2.5646 0.0078
dipole: 3.0158
quadrupole: -86.4421 -93.3332 -99.8098
quadrupole: 9.8154 0.0084 -0.0366
quadrupole: 6.7529 -0.1382 -6.6147 9.8154 0.0084 -0.0366
hfenergy: -762.77414 hartree
pointgroup: C01 [X(C13H14N2O2)]
dipole: 0.6662328 -0.9816232 0.0196572 debye
polarizability: 217.6760177|8.9819319|189.3222869|3.0290052|0.1507094|83.4361327 unknown
InChI: InChI=1S/C13H14N2O2/c1-2-17-13(16)9-5-3-6-10-12(9)15-8-4-7-11(15)14-10/h3,5-6H,2,4,7-8H2,1H3
charge 0 multiplicity 1
31 atoms
O  3.095365 -0.110614 0.156911
O  1.47825 -1.780203 0.112107
N  -1.46081 -0.752548 0.052134
N  -2.8744 1.058775 0.020621
C  -1.36568 -2.229543 0.054563
C  -2.867339 -2.690802 0.027718
C  -3.767819 -1.404738 0.003579
C  -2.779783 -0.27562 0.023661
C  -0.613324 0.359451 0.069458
C  -1.526178 1.489988 0.049237
C  0.797756 0.567591 0.100454
C  -1.038895 2.812267 0.059394
C  1.250519 1.91546 0.11002
C  0.357703 3.01361 0.089946
C  1.767963 -0.552755 0.122233
C  4.135305 -1.180845 0.180823
C  5.487863 -0.477138 0.226104
H  -0.828542 -2.57676 0.950024
H  -0.796605 -2.577388 -0.82077
H  -3.091243 -3.305854 0.91478
H  -3.056903 -3.315398 -0.86064
H  -4.443352 -1.351274 0.875263
H  -4.402375 -1.355678 -0.898664
H  -1.743794 3.649042 0.04376
H  2.329554 2.087831 0.133675
H  0.760878 4.03139 0.098346
H  3.959411 -1.819017 1.065856
H  4.013112 -1.806842 -0.721789
H  6.298916 -1.227907 0.245044
H  5.629101 0.163982 -0.660739
H  5.575548 0.151437 1.128692
