program: Gaussian 09
title: 000285755
version: EM64L-G09RevD.01
frameworkgroup: C1[X(C12H13NO)]
method: RPBEPBE
basis: SDD
operation: Freq
keyword: #p
keyword: freq=noraman
keyword: PBEPBE/SDD
title: #p freq=noraman PBEPBE/SDD
converged: YES YES NO NO
title: Mulliken charges:
elementType: O N C C C C C C C C C C C C H H H H H H H H H H H H H
charge: -0.261650 -0.236416 0.240833 0.165653 0.283992 0.055728 -0.366024 -0.355224 -0.665856 -0.787192 0.104547 -0.231902 -0.279125 -0.798137 0.223875 0.240876 0.248022 0.248021 0.241597 0.219424 0.269177 0.268858 0.224223 0.223135 0.234804 0.234845 0.253915
chargesum: 0.00000
title: Mulliken charges with hydrogens summed into heavy atoms:
elementType: O N C C C C C C C C C C C C
charge: -0.261650 -0.236416 0.240833 0.165653 0.283992 0.055728 -0.142148 -0.114348 0.071784 -0.029733 0.104547 -0.007679 -0.055989 -0.074574
polarizability: 1.94232629e+02 7.54585975e+00 1.65254695e+02 -2.51279287e-02 1.02325077e-02 6.91569174e+01
1716.lowfreq: -56.1518 -4.7974 -0.0010 -0.0007 -0.0003 2.0136 4.1756 68.2351 100.9488
frequency: -55.9860 68.1830 100.9482 112.7621 133.2570 148.5021 181.4271 218.8902 266.9556 309.2684 318.3301 320.1249 333.1268 382.5905 437.8748 490.6202 551.2931 551.7471 576.2506 583.5850 625.7714 673.7178 680.2176 750.5562 760.4819 767.9404 850.4589 882.4794 931.9594 953.6419 972.6237 974.1612 1020.4566 1023.9681 1035.4069 1037.0719 1097.9472 1116.6872 1136.4178 1155.4526 1172.9138 1224.4087 1277.9913 1324.1096 1363.1946 1371.3662 1396.1348 1406.8029 1416.6830 1440.3807 1444.7905 1448.1751 1463.8256 1464.8639 1470.2874 1481.0572 1481.3424 1494.2449 1519.5558 1560.1899 1584.5143 1622.8541 2981.1807 2994.6779 2997.9204 3068.9803 3075.1046 3077.0076 3100.5875 3119.8268 3125.7013 3128.7877 3139.7901 3159.5675 3177.7236
redmass: 1.1066 2.7022 4.4487 1.2538 2.3450 2.8091 4.4314 1.0620 3.5240 5.2599 4.0644 2.7571 3.0400 7.5736 2.9163 5.3905 4.7467 3.1095 3.7412 3.7793 4.3105 5.2739 3.3639 1.3420 4.1639 3.9684 1.5019 3.2174 1.3828 3.0002 2.6667 1.3080 1.6638 2.0233 1.8329 1.5786 2.4691 1.3138 1.5227 2.3418 1.1622 2.7096 2.2916 2.2421 1.3771 2.5655 2.6592 1.8434 2.1306 1.0438 1.4825 1.1916 1.7110 1.0495 2.6209 1.7906 1.0454 1.2170 5.7785 6.0159 6.4663 7.2026 1.0367 1.0364 1.0366 1.0975 1.1021 1.0958 1.1006 1.0993 1.0971 1.0854 1.0904 1.0966 1.0959
irintensity: 0.3723 4.0641 0.6761 2.0859 0.7164 4.5955 4.0682 1.3137 3.6633 0.5717 0.3402 1.8801 3.2487 3.0253 6.1547 0.2846 16.7006 1.1818 5.7972 0.3036 4.2543 1.8819 4.7570 93.3807 1.5184 0.0896 0.0535 9.9515 1.1830 27.1823 1.3137 0.0010 0.5938 16.6282 7.2142 10.7992 26.6546 0.4761 2.5131 34.6711 20.8416 43.1924 10.5649 16.5838 35.2980 7.3881 61.5394 10.0239 55.1063 16.4770 7.2858 90.6538 28.0537 18.9741 20.2439 40.8369 8.7884 76.7978 193.2320 134.3893 31.1256 6.6200 5.0386 38.6624 34.0279 14.6186 16.9818 6.5422 24.1973 21.1803 9.5256 0.1056 18.1567 29.5995 17.9054
temp: 298.150 k
press: 1.00000 atm
elementType: 8 7 6 6 6 6 6 6 6 6 6 6 6 6 1 1 1 1 1 1 1 1 1 1 1 1 1
symmnumber: 1
zpe: 574863.6 jmol-1
zpe.correction: 0.218954 hartree
zpe.thermalcorrener: 0.231408 hartree
zpe.thermalcorrenthalpy: 0.232353 hartree
zpe.thermalcorrgfe: 0.180632 hartree
zpe.sumelectzpe: -594.062830 hartree
zpe.sumelectthermal: -594.050376 hartree
zpe.sumelectthermalent: -594.049431 hartree
zpe.sumelectthermalfe: -594.101152 hartree
dipole: -3.4138 2.6874 0.0016
dipole: 4.3447
quadrupole: -91.9547 -64.4848 -86.0582
quadrupole: -0.5616 0.0033 0.0002
quadrupole: -11.1221 16.3478 -5.2256 -0.5616 0.0033 0.0002
hfenergy: -594.281784 hartree
pointgroup: C01 [X(C12H13N1O1)]
dipole: 1.2947981 1.1159322 -0.0006257 debye
polarizability: 194.8452391|-6.2299702|164.6420845|-0.0246485|-0.0113387|69.1569174 unknown
InChI: InChI=1S/C12H13NO/c1-8-12(9(2)14)10-6-4-5-7-11(10)13(8)3/h4-7H,1-3H3
charge 0 multiplicity 1
27 atoms
O  -3.369801 -0.622407 0.001089
N  0.221045 1.688761 0.000313
C  1.158285 0.630961 0.000209
C  0.423066 -0.605929 0.000488
C  -1.071743 1.164306 0.000444
C  -0.996707 -0.253432 0.000668
C  2.567655 0.684406 -0.000084
C  1.161226 -1.82032 0.000568
C  0.563836 3.115844 0.0000
C  -2.288545 2.041274 0.000304
C  -2.189321 -1.112998 0.000885
C  3.269825 -0.538368 -0.000004
C  2.570002 -1.776366 0.000332
C  -2.008984 -2.630513 -0.000068
H  3.115169 1.632894 -0.000457
H  0.656488 -2.789291 0.000812
H  0.170223 3.620355 -0.900023
H  0.164556 3.621871 0.896621
H  1.658171 3.223648 0.003481
H  -2.033267 3.11421 -0.002841
H  -2.924524 1.814468 -0.872814
H  -2.921695 1.819078 0.876717
H  4.365144 -0.53287 -0.000233
H  3.137811 -2.713335 0.000389
H  -1.4472 -2.962393 0.892909
H  -1.446673 -2.961329 -0.893102
H  -3.002043 -3.105527 -0.000604
