program: Gaussian 09
title: 000285754
version: EM64L-G09RevD.01
frameworkgroup: C1[X(C11H11NO)]
method: RPBEPBE
basis: SDD
operation: Freq
keyword: #p
keyword: freq=noraman
keyword: PBEPBE/SDD
title: #p freq=noraman PBEPBE/SDD
converged: NO YES NO NO
title: Mulliken charges:
elementType: O N C C C C C C C C C C C H H H H H H H H H H H
charge: -0.257514 -0.470494 0.156491 0.057149 0.221903 0.270707 -0.354166 -0.368162 0.103890 -0.755410 -0.277582 -0.214404 -0.797515 0.307727 0.240254 0.232200 0.268778 0.268711 0.192865 0.223185 0.225614 0.235584 0.235585 0.254603
chargesum: 0.00000
title: Mulliken charges with hydrogens summed into heavy atoms:
elementType: O N C C C C C C C C C C C
charge: -0.257514 -0.162767 0.156491 0.057149 0.221903 0.270707 -0.113912 -0.135961 0.103890 -0.025055 -0.054397 0.011210 -0.071742
polarizability: 1.87286766e+02 -5.14487846e+00 1.43823311e+02 1.20435138e-02 -1.15955469e-03 6.06893782e+01
1716.lowfreq: -3.7076 -0.0005 -0.0003 -0.0001 7.6031 9.2058 57.9030 104.7771 121.9715
frequency: 57.7444 104.7744 121.9442 137.9277 180.2542 204.7828 267.0164 282.2703 315.6291 329.0264 382.2826 436.5694 486.8639 530.2343 551.3491 581.7276 599.2841 600.6554 653.1428 676.6781 685.2017 753.7024 768.8832 854.6865 855.7780 919.5532 934.6072 952.8970 976.1705 1004.9453 1020.8219 1022.1385 1040.3554 1060.0079 1116.9841 1168.6379 1203.7973 1238.9754 1273.4777 1317.6764 1346.7669 1365.6808 1405.6456 1415.7488 1425.9757 1438.5618 1449.6160 1461.5163 1463.8637 1474.1245 1483.9390 1530.2993 1565.5872 1590.3518 1631.4708 2980.5648 2986.8440 3068.7636 3084.2979 3085.7007 3119.5226 3127.6178 3138.1300 3158.9268 3175.8995 3585.4444
redmass: 3.0050 4.0732 1.1007 3.5944 4.3596 1.0796 3.1113 4.7453 4.1354 3.3769 7.2751 2.9336 5.3419 3.4778 3.1035 3.5071 4.8065 1.1531 5.2624 5.1582 3.3399 1.3306 4.0962 4.7309 1.4760 3.1346 1.3825 2.9441 1.3061 1.7690 1.6922 2.0407 1.5640 2.7042 1.7553 1.1620 2.2718 1.3802 3.6929 1.9429 2.9635 1.2963 2.3826 1.7352 2.0296 1.0438 1.2414 1.0501 3.1767 1.4256 2.9729 5.3107 6.2565 6.0189 6.9649 1.0368 1.0382 1.0974 1.0962 1.0992 1.0994 1.0860 1.0905 1.0962 1.0964 1.0803
irintensity: 4.6625 0.6304 1.2026 4.2850 3.6767 2.2619 3.0255 1.1640 0.0632 7.0688 1.8344 6.3170 0.7093 9.0144 0.7266 3.5771 9.9506 80.1635 2.3268 1.8300 10.7846 101.8588 0.3556 0.3225 0.1360 14.1333 2.1603 24.5558 0.0287 15.5362 1.0720 7.4255 12.5847 7.8797 3.1238 8.8235 49.9526 11.1423 17.2818 14.9629 4.2448 39.3323 0.9808 65.5594 64.5164 14.3021 133.3493 18.9095 19.8062 5.6312 58.8333 166.7596 109.8639 61.8995 1.5222 5.0752 31.0236 14.3585 4.0823 20.8606 21.0158 0.5604 14.6864 27.6836 18.2193 49.0912
temp: 298.150 k
press: 1.00000 atm
elementType: 8 7 6 6 6 6 6 6 6 6 6 6 6 1 1 1 1 1 1 1 1 1 1 1
symmnumber: 1
zpe: 503809.2 jmol-1
zpe.correction: 0.191891 hartree
zpe.thermalcorrener: 0.203394 hartree
zpe.thermalcorrenthalpy: 0.204338 hartree
zpe.thermalcorrgfe: 0.154634 hartree
zpe.sumelectzpe: -554.846224 hartree
zpe.sumelectthermal: -554.834720 hartree
zpe.sumelectthermalent: -554.833776 hartree
zpe.sumelectthermalfe: -554.883481 hartree
dipole: -3.0145 -2.5019 -0.0001
dipole: 3.9175
quadrupole: -84.6714 -58.5138 -80.0714
quadrupole: -1.7638 0.0006 -0.0003
quadrupole: -10.2526 15.9051 -5.6526 -1.7638 0.0006 -0.0003
hfenergy: -555.0381146 hartree
pointgroup: C01 [X(C11H11N1O1)]
dipole: 1.1892436 0.9803793 -0.0000439 debye
dipolederiv: -1.3099041 -0.1839259 0.0000372 0.1096455 -0.5522079 0.0000227 0.0000442 0.0000563 -0.3194265 -0.7924715 -0.2975352 0.0000449 0.0223444 -0.5198671 0.0000032 0.0000309 -0.0000331 -0.2630523 0.5044326 -0.0829528 -0.0000536 0.081386 -0.20896 0.0000006 -0.000022 0.0000162 -0.0016365 -0.6241589 -0.1383026 0.0000234 -0.5675576 -0.8451417 0.0000599 0.0000603 0.0000346 -0.1147849 0.1186971 -0.0460459 0.0000042 -0.6260404 0.1468752 0.0000427 0.000012 -0.0000038 0.0412775 0.4994707 0.1574717 -0.000026 0.3635668 0.7925281 0.0000041 -0.0001545 0.000126 0.0535183 -0.0741631 -0.0305932 0.0000019 0.0457698 0.1157343 0.0000143 0.0000135 0.0000319 -0.1503549 0.0698735 -0.0074005 -0.0000266 0.0496384 0.0552996 0.0000014 -0.0000257 0.0000075 -0.1898194 1.5379511 0.3998449 -0.0000689 0.4404962 1.2194436 -0.0001397 -0.0000754 -0.0001065 0.1096077 -0.1970163 0.2079563 -0.0000496 0.0752767 0.1249086 -0.0000838 0.0000683 -0.000269 0.0011831 -0.051759 0.0097402 -0.0000138 -0.0723988 0.1058313 0.0000239 -0.0000135 0.0000146 -0.1796427 -0.0113502 0.0334823 -0.0000129 0.0898642 -0.0877659 -0.0000048 -0.0000123 -0.0000019 -0.1789074 -0.0078415 0.1414177 -0.0000004 0.0117203 -0.4829546 0.000034 -0.0000116 -0.0000206 0.0527308 0.1602124 -0.0014285 0.0000089 0.0178639 0.1896971 0.0000031 0.0000183 0.0000258 0.3194936 0.0829228 -0.0802999 -0.0000057 -0.0483465 -0.0702828 -0.0000095 -0.0000121 -0.0000134 0.1399773 0.0512721 -0.0487659 0.0000092 -0.0941913 -0.0869652 0.0000021 0.0000081 0.0000021 0.1757775 0.0459928 0.0240783 -0.0628571 0.0041445 0.0548246 -0.0488463 -0.0816724 -0.0054166 0.0022199 0.0459668 0.0241766 0.0628588 0.0043061 0.0547493 0.0487702 0.0816922 0.005363 0.0019724 0.0572715 -0.1235619 0.0000771 0.016438 -0.19558 0.0001294 0.0000075 0.0001749 0.1141943 -0.0000254 0.0996886 0.0000188 0.1168045 -0.0605088 -0.0000221 0.0000203 -0.0000198 0.1632569 -0.1423937 -0.0178064 0.0000261 -0.0158832 0.0865381 -0.0000012 0.0000264 -0.0000025 0.1649012 0.0555149 0.050631 -0.1114011 0.0174802 0.0632368 0.0017189 -0.0998823 0.0293527 -0.0291405 0.0556814 0.0506331 0.1113123 0.0174892 0.0632284 -0.0017701 0.0998016 -0.0294053 -0.029291 -0.0741758 -0.1405017 0.0000929 -0.0598169 0.0373391 0.000047 0.0000783 0.0000866 0.1159456 unknown
polarizability: 187.2522489|-5.2885566|143.8578286|-0.0120396|0.0011994|60.6893782 unknown
InChI: InChI=1S/C11H11NO/c1-7-11(8(2)13)9-5-3-4-6-10(9)12-7/h3-6,12H,1-2H3
charge 0 multiplicity 1
24 atoms
O  -3.296005 -0.584568 0.000604
N  0.141837 1.920705 0.000392
C  0.492181 -0.339961 0.000352
C  -0.950699 -0.077407 0.000475
C  1.148652 0.940188 0.000321
C  -1.116041 1.331568 0.000458
C  1.311861 -1.501419 0.00022
C  2.548739 1.097347 0.000207
C  -2.091211 -1.007273 0.000616
C  -2.360973 2.166261 0.000543
C  2.714717 -1.358135 0.000106
C  3.33168 -0.075545 0.000108
C  -1.816186 -2.509963 0.000825
H  0.30267 2.927237 0.000355
H  0.875404 -2.503429 0.000183
H  3.01606 2.088499 0.000189
H  -2.988582 1.930795 -0.875951
H  -2.987911 1.931664 0.877767
H  -2.121891 3.246122 -0.000042
H  3.345559 -2.253974 0.000006
H  4.424334 0.001087 0.000016
H  -1.232705 -2.803393 0.893467
H  -1.233498 -2.803724 -0.892239
H  -2.776291 -3.048784 0.001323
