program: Gaussian 09
title: 000285766
version: EM64L-G09RevD.01
frameworkgroup: C1[X(C12H12ClF3N2O2S)]
method: RPBEPBE
basis: SDD
operation: Freq
keyword: #p
keyword: freq=noraman
keyword: PBEPBE/SDD
title: #p freq=noraman PBEPBE/SDD
converged: YES YES NO NO
title: Mulliken charges:
elementType: Cl S F F F O O N N C C C C C C C C C C C C H H H H H H H H H H H H
charge: 0.026087 0.866050 -0.140188 -0.110270 -0.137768 -0.489123 -0.541578 -0.218779 -0.069720 0.315365 0.029734 -0.086601 -0.336962 0.206930 -0.378197 -0.339976 0.229134 -0.238457 -0.783105 -0.226440 -0.653048 0.308101 0.230220 0.236688 0.248721 0.284178 0.240380 0.280766 0.235346 0.317417 0.228045 0.228955 0.238094
chargesum: 0.00000
title: Mulliken charges with hydrogens summed into heavy atoms:
elementType: Cl S F F F O O N N C C C C C C C C C C C C
charge: 0.026087 0.866050 -0.140188 -0.110270 -0.137768 -0.489123 -0.541578 -0.218779 -0.069720 0.315365 0.029734 -0.086601 -0.028860 0.206930 0.088712 -0.091255 0.229134 0.045721 -0.026613 0.090977 0.042046
polarizability: 2.93748318e+02 -8.81114400e-01 1.64191352e+02 -1.21748831e+01 1.49332415e+01 1.50432350e+02
1716.lowfreq: -6.0032 0.0009 0.0014 0.0017 1.8232 7.0946 20.7305 22.2157 27.9859
frequency: 20.5778 22.2015 27.9132 46.5952 49.4986 77.4709 102.6425 106.9145 114.4148 149.6051 151.0324 159.8284 169.3327 191.2771 208.3671 215.8300 226.1021 233.3756 267.5269 281.8101 290.3301 321.9634 327.9525 353.5354 392.7807 416.4357 421.2792 442.3548 451.1439 512.5932 533.4798 550.0185 589.4917 607.5450 661.6307 668.4450 675.2454 706.3423 721.1875 768.9115 775.0862 794.4374 815.2122 841.9243 868.5553 887.0625 909.4733 944.7364 951.0186 961.3821 990.3856 995.8138 1029.9068 1044.2511 1047.2114 1082.1152 1099.5186 1144.8315 1162.5901 1179.6873 1212.8654 1214.0835 1240.6761 1262.0535 1311.5566 1330.6184 1338.6033 1366.4035 1392.0199 1399.7528 1403.5069 1431.3282 1455.9694 1465.2787 1468.6216 1472.2918 1481.3687 1493.4685 1514.2615 1583.0983 1613.9522 2985.4806 2993.4522 3013.5753 3060.4837 3069.8623 3094.5101 3101.4728 3118.3544 3127.0150 3150.3508 3170.6917 3173.2635
redmass: 5.5787 13.2588 6.4506 3.0807 10.4453 5.8266 7.7525 7.0350 4.0925 3.0239 1.4714 3.9141 10.5516 1.6727 14.5166 4.9598 6.4927 5.3125 5.6482 5.0858 2.1403 5.1004 15.8083 8.0656 7.3118 6.0739 11.6207 3.2869 7.4768 5.4889 13.1736 3.8627 4.1571 4.2201 5.5443 6.9909 7.1024 5.4968 7.0574 2.9336 1.3186 14.3625 1.6094 6.7954 5.2321 3.1844 1.4847 8.9169 1.4470 2.3138 6.8355 1.7772 2.0578 8.9462 1.5128 2.4112 2.5042 1.4217 1.9707 8.7550 1.1813 4.9849 1.7804 1.4084 1.2690 2.0231 1.7024 2.3304 1.2356 1.2427 2.9000 4.0307 1.3118 2.0264 1.0981 1.1443 1.1336 1.1840 5.1768 8.1484 7.8426 1.0398 1.0356 1.0628 1.0976 1.1006 1.0998 1.1020 1.0874 1.0965 1.0888 1.0958 1.0945
irintensity: 0.0769 0.4660 0.6405 0.1963 1.4499 0.5550 1.0101 1.3818 0.9651 0.9979 0.6369 2.6127 4.1646 1.3140 2.4134 1.3664 2.8705 2.0792 10.3434 5.2466 0.5460 6.1496 1.3098 8.4852 7.5858 96.3800 2.8779 2.1383 133.9964 8.7156 3.1247 14.3444 33.2371 21.3065 14.2622 41.3974 38.3202 0.7421 6.3809 3.7296 12.0812 104.3141 36.5083 8.2679 5.7890 1.1023 13.4400 48.2187 5.3640 10.4691 71.9463 5.6176 48.4520 130.1701 3.7701 15.0556 6.1493 23.0837 10.6516 107.5273 1.7891 24.4607 9.0301 23.5211 2.3086 52.3450 67.7711 36.4478 18.4720 14.3704 16.7664 23.8031 25.6686 46.6177 10.1684 14.9116 3.3499 21.5582 56.2503 5.1927 34.1915 22.5347 16.6454 32.0599 13.8063 1.5872 37.0553 31.5318 1.4914 3.6088 5.9298 3.4824 13.4167
temp: 298.150 k
press: 1.00000 atm
elementType: 17 16 9 9 9 8 8 7 7 6 6 6 6 6 6 6 6 6 6 6 6 1 1 1 1 1 1 1 1 1 1 1 1
symmnumber: 1
zpe: 593769.3 jmol-1
zpe.correction: 0.226155 hartree
zpe.thermalcorrener: 0.248065 hartree
zpe.thermalcorrenthalpy: 0.249009 hartree
zpe.thermalcorrgfe: 0.172323 hartree
zpe.sumelectzpe: -1880.341847 hartree
zpe.sumelectthermal: -1880.319936 hartree
zpe.sumelectthermalent: -1880.318992 hartree
zpe.sumelectthermalfe: -1880.395678 hartree
dipole: 9.5884 5.7826 1.0986
dipole: 11.2509
quadrupole: -106.8560 -144.0083 -141.1806
quadrupole: 1.7559 3.9178 5.1425
quadrupole: 23.8257 -13.3267 -10.4990 1.7559 3.9178 5.1425
hfenergy: -1880.5680016 hartree
pointgroup: C01 [X(C12H12Cl1F3N2O2S1)]
dipole: 3.8556184 -2.044148 0.7409355 debye
polarizability: 293.8105095|10.4154438|174.2005482|3.9817214|-0.4799329|140.3609622 unknown
InChI: InChI=1S/C12H12ClF3N2O2S/c1-3-18-7(2)17-9-6-8(4-5-10(9)18)21(19,20)12(15,16)11(13)14/h4-6,11H,3H2,1-2H3
charge 0 multiplicity 1
33 atoms
Cl -5.344579 -1.103919 2.038802
S  -2.19823 0.364056 -1.133589
F  -2.314284 -1.024596 1.310096
F  -3.052367 1.132205 1.473515
F  -5.289365 0.50004 -0.127428
O  -2.460727 1.92565 -1.496889
O  -2.746027 -0.878998 -2.048162
N  3.65516 -0.191066 -0.057963
N  2.747203 1.894152 0.25364
C  2.292384 -0.321483 -0.345171
C  1.739544 0.995898 -0.151212
C  -0.374412 0.104298 -0.775239
C  0.365816 1.226011 -0.372835
C  3.87393 1.159506 0.302834
C  4.644492 -1.284981 -0.063054
C  1.515529 -1.423752 -0.76355
C  -3.116348 -0.031562 0.71078
C  0.142529 -1.197963 -0.981419
C  5.220514 1.692271 0.681587
C  -4.527521 -0.551509 0.452423
C  4.599014 -2.138407 1.22245
H  -0.083048 2.2171 -0.260596
H  4.457306 -1.914427 -0.952365
H  5.64486 -0.837954 -0.191466
H  1.943281 -2.418887 -0.919303
H  -0.518502 -1.998181 -1.327574
H  5.937092 1.640351 -0.159819
H  5.104294 2.7477 0.968544
H  5.661668 1.143132 1.53388
H  -4.509204 -1.412835 -0.231614
H  4.820236 -1.525548 2.113705
H  5.348013 -2.948262 1.165387
H  3.604949 -2.597343 1.362706
