program: Gaussian 09
title: 000285763
version: EM64L-G09RevD.01
frameworkgroup: C1[X(C17H12ClNO2)]
method: RPBEPBE
basis: SDD
operation: Freq
keyword: #p
keyword: freq=noraman
keyword: PBEPBE/SDD
title: #p freq=noraman PBEPBE/SDD
converged: YES YES NO NO
title: Mulliken charges:
elementType: Cl O O N C C C C C C C C C C C C C C C C C H H H H H H H H H H H H
charge: -0.076585 -0.514308 -0.278622 -0.493020 0.251129 0.434998 0.084317 0.100414 -0.477185 -0.341308 -0.346593 -0.421122 0.118622 -0.272143 -0.236974 0.512565 -0.445344 -0.361199 -0.039737 -0.190332 -0.263710 0.244325 0.285925 0.178366 0.248610 0.235274 0.236125 0.395124 0.251257 0.314770 0.379508 0.230942 0.255910
chargesum: 0.00000
title: Mulliken charges with hydrogens summed into heavy atoms:
elementType: Cl O O N C C C C C C C C C C C C C C C C C
charge: -0.076585 -0.134799 -0.278622 -0.097897 0.251129 0.434998 0.084317 0.100414 -0.232860 -0.055383 -0.168227 -0.172512 0.118622 -0.036870 -0.000849 0.512565 -0.194087 -0.046429 -0.039737 0.040610 -0.007800
polarizability: 3.81869447e+02 -1.45658462e+01 2.37479134e+02 -3.44149256e-02 -4.08471718e-02 7.69517340e+01
1716.lowfreq: -8.3773 -3.4096 -0.0007 0.0005 0.0012 2.9701 26.4278 31.7949 55.3873
frequency: 26.3994 31.7711 55.3733 73.4561 84.9118 96.2438 167.9651 185.4063 197.0450 212.5199 236.8136 252.5277 264.7144 304.6549 345.7983 352.3203 395.5326 412.3370 421.2141 437.8533 464.5844 489.2176 494.1178 554.1070 563.1717 567.5141 602.4147 617.4686 635.4673 670.4848 685.8134 710.2167 722.6996 751.0845 786.5235 789.5699 809.0899 812.2469 834.6672 855.5042 862.5828 872.9846 876.1728 906.3643 912.8752 949.6561 977.5473 990.1302 992.5360 1005.9039 1031.4401 1059.0839 1070.4916 1094.0143 1109.2247 1149.1941 1158.9403 1174.4723 1183.7809 1230.6549 1236.1716 1242.7963 1269.3419 1274.1388 1310.3583 1351.7451 1373.4575 1409.2779 1418.2419 1420.9624 1433.8993 1460.7797 1473.1976 1509.3220 1538.8399 1571.0775 1583.0219 1606.3084 1612.0876 1629.2324 1638.2790 3081.0093 3131.0484 3140.8728 3144.4634 3147.9063 3148.7188 3167.4454 3168.1209 3177.3810 3201.3147 3375.2067 3606.6052
redmass: 6.0472 5.4156 8.6292 4.0188 4.3203 3.8106 8.2507 5.4674 7.3955 4.2547 1.5894 4.3748 7.2337 5.1460 6.4628 7.4594 8.3817 7.8333 2.7149 3.0706 5.3756 4.1234 6.8643 7.4081 3.3011 4.7957 6.1775 6.9454 5.1309 7.5500 2.2637 6.1741 2.5464 1.6316 2.1925 1.5319 6.7543 1.2503 1.5294 5.5355 5.2171 1.5055 1.6843 5.0705 1.3736 1.3917 5.9042 1.3392 1.3148 1.3427 2.5121 3.8888 2.0386 1.5822 2.5394 1.6207 1.2396 1.0866 1.1296 1.9170 1.8013 3.4071 1.5510 1.6905 1.8385 3.2508 5.4609 2.8551 3.7199 3.7325 4.0024 2.6683 2.7664 3.6795 3.0579 7.8990 6.2485 5.9790 7.1518 2.2477 5.4710 1.0884 1.0874 1.0889 1.0889 1.0931 1.0924 1.0986 1.0974 1.0957 1.0953 1.0800 1.0656
irintensity: 0.1859 0.9638 0.2765 15.4692 0.7215 4.0132 5.8433 0.5416 2.8585 0.8592 79.8312 11.7965 3.2658 0.0521 6.9921 1.0358 6.2822 4.1717 28.1419 6.4306 13.5834 0.0402 20.2120 8.9553 10.6262 1.5840 5.8172 0.5651 0.6727 22.4800 24.3641 17.9923 2.6428 64.2382 33.5525 47.7659 8.0947 44.7168 16.6224 10.2523 37.4154 107.4672 11.2616 6.2236 5.7702 5.1373 14.0334 0.6127 5.1340 0.0413 6.4604 7.1759 33.9407 47.1916 123.1887 14.6710 9.6528 0.7944 1.2692 15.8565 10.3525 85.4730 21.2740 32.3723 44.8109 106.0326 140.0750 3.8815 29.9690 15.6192 10.9767 11.7552 160.7686 11.4619 358.0738 127.0631 202.0295 30.6316 122.4331 110.1427 60.5600 21.1583 0.6132 4.8754 14.7994 21.5939 2.2484 10.5817 29.5106 3.8971 9.3975 173.7484 34.6291
temp: 298.150 k
press: 1.00000 atm
elementType: 17 8 8 7 6 6 6 6 6 6 6 6 6 6 6 6 6 6 6 6 6 1 1 1 1 1 1 1 1 1 1 1 1
symmnumber: 1
zpe: 642583.1 jmol-1
zpe.correction: 0.244747 hartree
zpe.thermalcorrener: 0.262095 hartree
zpe.thermalcorrenthalpy: 0.263039 hartree
zpe.thermalcorrgfe: 0.197977 hartree
zpe.sumelectzpe: -1318.861819 hartree
zpe.sumelectthermal: -1318.844471 hartree
zpe.sumelectthermalent: -1318.843527 hartree
zpe.sumelectthermalfe: -1318.908589 hartree
dipole: 5.2101 -3.0324 -0.0208
dipole: 6.0283
quadrupole: -110.9850 -120.9933 -135.6960
quadrupole: -12.2446 -0.0406 0.0247
quadrupole: 11.5731 1.5648 -13.1379 -12.2446 -0.0406 0.0247
hfenergy: -1319.1065663 hartree
pointgroup: C01 [X(C17H12Cl1N1O2)]
dipole: -2.2066865 0.0367282 0.8684931 debye
polarizability: 379.0510533|-34.3377784|90.4352952|1.6592697|-38.079029|226.8139661 unknown
InChI: InChI=1S/C17H12ClNO2/c18-12-5-3-6-13(10-12)19-17(21)15-9-8-11-4-1-2-7-14(11)16(15)20/h1-10,19-20H
charge 0 multiplicity 1
33 atoms
Cl 5.388832 -1.388993 3.075698
O  -0.792303 -0.280247 1.416029
O  1.160124 0.436429 -2.296575
N  1.423663 -0.161498 -0.041661
C  -2.965238 0.229875 0.359646
C  -3.693015 0.615922 -0.831131
C  -0.8316 0.31748 -0.929911
C  -1.532158 0.092625 0.270719
C  -2.971472 0.844319 -2.048774
C  -1.591385 0.697107 -2.088094
C  -3.699666 0.001001 1.57119
C  -5.116868 0.75815 -0.75853
C  0.662015 0.203567 -1.148338
C  -5.088463 0.147533 1.610667
C  -5.805188 0.53032 0.434584
C  2.827428 -0.338141 0.031228
C  3.35444 -0.715813 1.299875
C  3.709969 -0.160886 -1.070944
C  4.737052 -0.905158 1.436611
C  5.094073 -0.362308 -0.886728
C  5.634937 -0.736969 0.365346
H  -3.524186 1.135825 -2.948163
H  -1.016694 0.864279 -3.004196
H  -3.195943 -0.296817 2.502025
H  -5.659789 1.051002 -1.664533
H  -5.6316 -0.031791 2.544252
H  -6.893659 0.642251 0.475924
H  0.886739 -0.319469 0.823867
H  2.690999 -0.857189 2.159477
H  3.300132 0.127512 -2.039527
H  -1.364539 -0.402106 2.210324
H  5.77012 -0.224623 -1.737479
H  6.708439 -0.89139 0.501823
