program: Gaussian 09
title: 000285749
version: EM64L-G09RevD.01
frameworkgroup: C1[X(C14H10N2O)]
method: RPBEPBE
basis: SDD
operation: Freq
keyword: #p
keyword: freq=noraman
keyword: PBEPBE/SDD
title: #p freq=noraman PBEPBE/SDD
converged: YES YES NO NO
title: Mulliken charges:
elementType: O N N C C C C C C C C C C C C C C H H H H H H H H H H
charge: -0.238726 -0.406163 0.002018 0.163440 0.202237 0.212560 -0.358613 0.026012 -0.382177 -0.350743 0.324895 -0.244787 -0.209151 -0.300615 -0.347282 -0.346273 -0.343760 0.291903 0.316360 0.288598 0.233195 0.227894 0.226804 0.266445 0.259644 0.244456 0.241832
chargesum: 0.00000
title: Mulliken charges with hydrogens summed into heavy atoms:
elementType: O N N C C C C C C C C C C C C C C
charge: -0.238726 -0.089803 0.002018 0.163440 0.202237 0.212560 -0.066710 0.026012 -0.093579 -0.117548 0.324895 -0.016893 0.017652 -0.034171 -0.087638 -0.101817 -0.101928
polarizability: 2.65512429e+02 -2.64634673e+00 1.64036368e+02 8.18083623e+00 3.81527427e+00 8.14604949e+01
1716.lowfreq: -5.6022 -0.0002 0.0004 0.0007 1.1051 7.9858 35.2676 51.0421 83.9437
frequency: 35.2469 51.0377 83.9428 119.7334 157.9185 180.9598 231.2794 253.1998 296.6486 368.3040 370.7828 409.5565 425.3432 470.3540 523.4444 571.7271 572.5604 593.0564 616.4910 630.5005 659.2640 681.1244 715.4045 753.5775 759.6969 763.8979 778.4793 839.2488 843.5512 863.1907 868.2039 881.9249 895.8929 949.9733 957.9253 974.4027 980.2924 990.5710 1010.9575 1060.4220 1071.8019 1083.9681 1109.8027 1141.2596 1166.4433 1202.5031 1219.1795 1244.1815 1258.4758 1294.1083 1301.7644 1324.8834 1359.0656 1393.8868 1398.5838 1422.8024 1449.9630 1460.1490 1484.1897 1510.6955 1532.3842 1554.7371 1579.4690 1590.6305 1631.9662 3129.9080 3130.7624 3138.5039 3143.4268 3160.2107 3161.7861 3170.3899 3184.3831 3233.6534 3597.5363
redmass: 6.6218 4.4021 5.0498 6.1996 6.6891 5.9798 4.0696 6.3748 5.7779 6.3737 2.7977 5.6270 2.9291 4.8671 6.4784 3.9082 2.1792 2.2465 4.1680 3.2466 6.9019 6.3182 3.8322 3.0994 1.4632 4.5037 2.9260 1.3805 2.1504 3.6810 1.5365 5.2340 1.2618 1.3743 5.4056 1.4333 1.4820 1.3194 2.0776 2.5824 2.9457 1.6528 1.6992 1.3436 1.1074 2.6454 1.3713 1.6424 2.7628 3.5608 3.2074 1.5226 2.7039 4.5334 2.0013 2.5590 3.4631 1.9691 3.0437 7.4699 6.3979 7.8634 5.7731 6.5845 7.1202 1.0883 1.0860 1.0897 1.0913 1.0955 1.0974 1.0968 1.0968 1.0982 1.0811
irintensity: 0.1130 0.2986 1.0993 1.7142 4.1017 5.5985 6.4498 3.0065 2.1188 3.1105 0.6890 0.6553 11.3181 7.6699 7.9978 0.5782 38.5270 26.3856 41.6803 30.1470 1.7982 22.3185 7.1121 1.8243 111.7573 7.3666 33.7283 12.2505 34.6341 5.6831 0.1191 52.1853 4.4241 4.1349 2.6487 0.6609 2.4568 0.6941 12.6379 10.3395 0.0795 0.4559 32.1312 18.5033 1.0788 70.0521 4.2358 43.1510 10.6693 7.8139 22.3231 4.2968 7.5683 83.4193 22.7415 106.3123 26.1415 0.4368 0.1089 47.9323 235.0055 104.6197 8.4970 3.1912 1.4102 17.2774 0.4256 18.6476 18.1787 15.0989 27.8437 6.2621 7.1478 0.5574 75.7648
temp: 298.150 k
press: 1.00000 atm
elementType: 8 7 7 6 6 6 6 6 6 6 6 6 6 6 6 6 6 1 1 1 1 1 1 1 1 1 1
symmnumber: 1
zpe: 538484.3 jmol-1
zpe.correction: 0.205098 hartree
zpe.thermalcorrener: 0.217902 hartree
zpe.thermalcorrenthalpy: 0.218846 hartree
zpe.thermalcorrgfe: 0.164774 hartree
zpe.sumelectzpe: -723.067885 hartree
zpe.sumelectthermal: -723.055081 hartree
zpe.sumelectthermalent: -723.054137 hartree
zpe.sumelectthermalfe: -723.108209 hartree
dipole: 3.5745 4.7263 -0.7968
dipole: 5.9791
quadrupole: -102.3443 -86.8903 -99.4136
quadrupole: 7.3765 1.9383 -0.6030
quadrupole: -6.1282 9.3257 -3.1975 7.3765 1.9383 -0.6030
hfenergy: -723.2729832 hartree
pointgroup: C01 [X(C14H10N2O1)]
dipole: 1.3582325 1.8389033 0.5543326 debye
polarizability: 265.0910248|-5.0819328|145.9778448|11.3632725|34.1818126|99.9404219 unknown
InChI: InChI=1S/C14H10N2O/c17-14(10-5-7-15-8-6-10)12-9-16-13-4-2-1-3-11(12)13/h1-9,16H
charge 0 multiplicity 1
27 atoms
O  -0.424321 -1.858675 -1.011118
N  1.621615 2.063501 0.417129
N  -4.860089 0.303047 0.154169
C  1.857666 -0.159011 -0.071983
C  0.437433 0.186619 -0.114287
C  2.574843 1.034219 0.274846
C  0.350585 1.560712 0.188153
C  -0.655564 -0.719007 -0.483165
C  2.579762 -1.359865 -0.289683
C  3.977117 1.069709 0.420918
C  -2.093172 -0.308128 -0.248954
C  3.981934 -1.33455 -0.146705
C  4.672683 -0.137938 0.20412
C  -3.081544 -0.734909 -1.172603
C  -2.526037 0.411838 0.894516
C  -4.432226 -0.401184 -0.939721
C  -3.904442 0.684788 1.052417
H  -0.524004 2.20729 0.2111
H  1.836585 3.034315 0.638464
H  2.045394 -2.270386 -0.571398
H  4.509729 1.988649 0.688919
H  4.55747 -2.251705 -0.312513
H  5.763384 -0.155734 0.305019
H  -2.784969 -1.32456 -2.045212
H  -1.817158 0.717094 1.670406
H  -5.215011 -0.705683 -1.643195
H  -4.269466 1.225651 1.933161
