program: Gaussian 09
title: 000285732
version: EM64L-G09RevD.01
frameworkgroup: C1[X(C11H20N4O)]
method: RPBEPBE
basis: SDD
operation: Freq
keyword: #p
keyword: freq=noraman
keyword: PBEPBE/SDD
title: #p freq=noraman PBEPBE/SDD
converged: YES YES NO NO
title: Mulliken charges:
elementType: O N N N N C C C C C C C C C C C H H H H H H H H H H H H H H H H H H H H
charge: -0.332098 -0.445161 -0.092382 -0.622581 -0.643668 -0.363462 -0.360426 -0.393250 -0.353551 -0.527178 -0.355647 0.218045 -0.695127 0.104231 0.041721 0.170230 0.196578 0.218308 0.185772 0.182462 0.180255 0.214555 0.191496 0.189487 0.247237 0.222156 0.193367 0.193704 0.293162 0.210436 0.211337 0.214781 0.312158 0.369380 0.289087 0.334587
chargesum: 0.00000
title: Mulliken charges with hydrogens summed into heavy atoms:
elementType: O N N N N C C C C C C C C C C C
charge: -0.332098 -0.151999 -0.092382 0.058956 -0.019995 0.051424 0.007808 0.001559 0.027432 -0.057785 0.031425 0.218045 -0.058573 0.104231 0.041721 0.170230
polarizability: 1.64406861e+02 -2.81575695e+01 1.43345588e+02 1.77153428e+00 3.79834415e+00 1.56419227e+02
1716.lowfreq: -8.3724 -3.1243 -0.0003 0.0004 0.0008 9.7507 11.0892 23.2572 48.4748
frequency: 8.4599 22.7083 48.3987 53.0274 63.0900 87.5055 110.1731 121.2080 134.5349 149.1661 199.4798 211.9156 239.2146 247.5965 277.6477 285.4359 334.5818 354.4919 378.3292 402.8014 422.9947 429.1847 490.5126 513.0761 523.4844 539.8187 603.2001 641.8775 653.3312 666.1597 694.4547 722.5485 738.1867 752.2105 777.4002 803.0194 845.4143 882.5881 895.1351 952.0807 982.1785 988.3792 1010.6679 1022.8224 1044.2216 1046.1334 1070.7479 1081.0642 1101.1551 1116.1770 1135.1763 1183.2639 1199.5194 1212.7676 1236.3844 1249.6754 1278.0022 1284.5862 1285.6343 1293.1509 1298.2969 1317.2045 1335.4898 1354.3589 1361.4604 1366.4737 1388.5448 1395.3992 1451.4537 1459.8279 1461.1355 1462.3380 1466.4997 1474.3572 1477.9193 1482.6046 1488.8245 1508.3886 1546.0331 1575.7811 1617.0823 1635.2305 2947.7141 2954.0204 2955.6972 2965.3590 2971.3255 2972.4741 2980.4812 2985.5836 2999.6416 3009.2481 3027.8088 3042.9885 3069.6736 3070.1158 3070.9710 3461.3437 3529.1478 3597.8736 3677.1956 3684.5783
redmass: 4.6301 4.6295 2.2768 2.3518 2.6177 3.6817 2.3022 2.1839 2.8014 3.0524 3.2421 5.0537 1.1150 3.2137 2.5135 2.2267 2.1283 3.2391 3.3959 3.3829 1.6135 2.1638 2.7346 1.2511 2.1439 1.4435 3.5687 4.2808 1.7170 1.9661 3.4586 1.0776 1.2098 8.5016 2.0485 1.8131 1.8927 1.4963 1.6009 2.6082 3.7875 1.4066 3.1258 2.0165 2.5073 2.3356 2.0074 2.1670 1.7499 2.2104 2.4954 1.6020 1.4396 2.4107 1.3773 1.3049 1.2792 1.4656 1.2756 1.2863 1.1771 1.4563 1.4110 1.6364 1.5825 4.4845 1.2169 3.7774 2.3396 1.2917 1.0828 1.0768 1.0848 1.0792 1.0434 1.0850 1.0909 4.0148 2.2387 2.3970 1.3220 5.2679 1.0591 1.0620 1.0589 1.0595 1.0591 1.0367 1.0673 1.0970 1.0990 1.0989 1.1040 1.1040 1.1000 1.0957 1.0994 1.0510 1.0447 1.0809 1.0990 1.1038
irintensity: 2.1135 2.3515 2.7542 6.6543 1.4770 0.5259 0.4021 0.1798 0.1071 2.3641 4.5173 2.1473 0.0266 0.2230 5.1051 7.6293 69.4942 16.9792 17.7062 0.9209 79.9341 44.0482 4.2993 257.1573 90.3983 58.4069 7.7124 11.1436 21.3585 63.5194 4.7488 10.7721 0.3984 40.5714 0.7338 2.2828 2.7606 0.5476 2.5963 1.8752 6.4060 7.0627 12.7802 17.2611 10.3986 0.8444 0.3253 0.9826 3.1181 7.4704 14.6667 4.2473 4.0109 10.3973 2.6273 2.9660 3.8182 35.6082 22.4019 23.5977 3.1972 9.5987 17.5593 1.8363 20.0442 113.9286 11.4000 43.6011 43.0002 16.5335 4.1854 0.1651 2.9924 3.0481 10.8721 4.2470 20.1670 255.5763 106.1537 224.5203 64.4569 535.2948 3.9809 22.3719 1.0947 38.0529 96.4506 45.8387 41.0981 3.1415 2.9425 14.4222 4.1912 141.0468 57.9785 50.1468 56.3292 64.7736 45.3278 23.4278 77.1315 18.4147
temp: 298.150 k
press: 1.00000 atm
elementType: 8 7 7 7 7 6 6 6 6 6 6 6 6 6 6 6 1 1 1 1 1 1 1 1 1 1 1 1 1 1 1 1 1 1 1 1
symmnumber: 1
zpe: 807456.0 jmol-1
zpe.correction: 0.307544 hartree
zpe.thermalcorrener: 0.325883 hartree
zpe.thermalcorrenthalpy: 0.326827 hartree
zpe.thermalcorrgfe: 0.258022 hartree
zpe.sumelectzpe: -724.186546 hartree
zpe.sumelectthermal: -724.168207 hartree
zpe.sumelectthermalent: -724.167262 hartree
zpe.sumelectthermalfe: -724.236067 hartree
dipole: -2.2407 1.6534 -4.1361
dipole: 4.9861
quadrupole: -109.0357 -101.0437 -83.3222
quadrupole: 2.3850 -7.9166 -0.8213
quadrupole: -11.2351 -3.2432 14.4784 2.3850 -7.9166 -0.8213
hfenergy: -724.4940893 hartree
pointgroup: C01 [X(C11H20N4O1)]
dipole: 0.8155448 -1.2722111 -1.2508405 debye
polarizability: 164.9835954|-26.360642|143.0755174|9.7016559|3.6085373|156.1125632 unknown
InChI: InChI=1S/C11H20N4O/c1-2-3-4-5-6-7-8-14-9(11(13)16)10(12)15-8/h14H,2-7,12-13H2,1H3
charge 0 multiplicity 1
36 atoms
O  -4.059519 1.892665 -0.524883
N  -1.618625 -0.936729 -0.393139
N  -1.360006 -0.493239 1.812044
N  -2.905986 1.380334 2.007702
N  -3.504768 0.527207 -2.321678
C  2.100079 -0.930395 0.386872
C  3.348332 -0.706912 -0.496384
C  1.291989 -2.18469 -0.009415
C  4.156118 0.547388 -0.094939
C  0.029581 -2.403513 0.873397
C  5.399066 0.786662 -0.982775
C  -0.974132 -1.288806 0.782265
C  6.197378 2.043674 -0.5751
C  -2.481761 0.161903 -0.115939
C  -2.288323 0.406842 1.270609
C  -3.378558 0.898202 -0.981719
H  2.408482 -1.020287 1.448735
H  1.445539 -0.037124 0.334147
H  4.00655 -1.599811 -0.442026
H  3.036455 -0.615392 -1.558561
H  1.001179 -2.114638 -1.079356
H  1.936854 -3.082206 0.075883
H  3.495775 1.438408 -0.141975
H  4.475163 0.454845 0.964242
H  0.326274 -2.475185 1.93412
H  -0.44755 -3.367175 0.602645
H  5.078553 0.878017 -2.040991
H  6.059127 -0.10383 -0.934346
H  -1.466702 -1.379469 -1.296827
H  6.552297 1.965479 0.469906
H  5.569842 2.951943 -0.647874
H  7.08144 2.190372 -1.222626
H  -2.704209 1.47125 2.998955
H  -3.557647 1.991517 1.50633
H  -3.043944 -0.280281 -2.734195
H  -4.146844 1.072574 -2.894508
