program: Gaussian 09
title: 000285668
version: EM64L-G09RevD.01
frameworkgroup: C1[X(C15H24N2O3)]
method: RPBEPBE
basis: SDD
operation: Freq
keyword: #p
keyword: freq=noraman
keyword: PBEPBE/SDD
title: #p freq=noraman PBEPBE/SDD
converged: YES YES NO NO
title: Mulliken charges:
elementType: O O O N N C C C C C C C C C C C C C C C H H H H H H H H H H H H H H H H H H H H H H H H
charge: -0.454594 -0.432263 -0.288240 0.006824 -0.167076 -0.325265 -0.045734 0.377794 -0.078453 -0.523450 -0.503126 -0.492572 -0.351254 -0.347156 -0.416339 -0.439772 -0.449854 -0.440976 0.185830 -0.489031 0.248756 0.312755 0.214634 0.292244 0.213309 0.190326 0.243731 0.250762 0.185981 0.251062 0.202403 0.201805 0.252751 0.257340 0.201643 0.208279 0.266837 0.215586 0.224648 0.218902 0.210422 0.333783 0.229860 0.246887
chargesum: 0.00000
title: Mulliken charges with hydrogens summed into heavy atoms:
elementType: O O O N N C C C C C C C C C C C C C C C
charge: -0.120812 -0.432263 -0.288240 0.006824 -0.167076 -0.076508 0.267021 0.377794 0.136181 -0.017896 -0.069069 -0.055829 0.102211 0.107400 0.042643 0.035344 -0.009620 -0.011652 0.185830 -0.012285
polarizability: 2.06333779e+02 -3.13187093e+00 1.82262031e+02 7.22830494e+00 9.63382352e-03 1.37658017e+02
1716.lowfreq: -24.4559 -0.0005 -0.0003 0.0003 4.4052 10.4999 47.6305 60.5175 111.9816
frequency: 47.1916 60.4712 111.9762 121.3519 148.1017 179.9974 219.2280 235.8904 262.4870 269.8186 288.4322 295.7620 305.3851 310.5181 322.6147 366.6346 378.1953 381.7402 411.2092 426.4260 448.4213 466.0549 473.9330 491.9762 516.2057 537.4104 558.8459 578.1117 585.2343 618.4433 656.0709 733.5264 764.1401 786.7565 816.3007 831.6177 844.2758 854.1561 859.2029 874.6312 882.6217 892.8189 902.6071 905.5046 931.2845 938.8185 959.3441 974.5163 992.8171 1007.2378 1022.0620 1045.7202 1055.0105 1068.1713 1076.1808 1091.2817 1097.4150 1104.7297 1119.9021 1131.9164 1138.8161 1141.9056 1160.8522 1171.8840 1182.2959 1196.0780 1207.6883 1225.0606 1231.0367 1238.8615 1247.6689 1262.3902 1265.0775 1288.2551 1291.6637 1305.2507 1310.5429 1315.6508 1321.2964 1328.6686 1333.0105 1339.4135 1344.4570 1347.4796 1353.5846 1354.0499 1356.8241 1361.2871 1376.3502 1412.2550 1437.3918 1447.4295 1450.8924 1452.4032 1455.1462 1457.6152 1461.7343 1469.1198 1469.6517 1477.4663 1519.0889 1584.6144 2751.8129 2867.2995 2934.6357 2947.3080 2962.5132 2969.5046 2979.3846 2980.3790 2984.9768 2992.7243 2992.7873 3008.0091 3014.6682 3026.2814 3046.0546 3049.7294 3056.3257 3058.0167 3073.7948 3075.8530 3076.6034 3077.4612 3086.6377 3093.1135
redmass: 4.9095 4.0397 3.0839 3.6556 2.6711 3.4280 3.2326 3.9731 4.3302 3.4540 2.2560 2.7642 2.7610 2.5849 3.7056 3.4361 3.1263 2.9208 2.9716 3.7917 3.4274 3.0082 2.8713 2.9869 3.1738 3.0070 2.8133 3.1079 2.7638 3.5448 2.7034 3.9583 3.0537 3.8081 2.7076 2.7423 1.8241 1.5628 1.5949 1.8073 2.4606 1.8150 1.8305 2.4249 2.4664 2.2705 2.2810 2.3257 2.5968 2.4441 1.7541 1.9484 2.1055 2.1758 2.3174 2.0695 2.3267 2.1537 1.6799 2.3492 2.3302 2.2175 2.1943 1.9120 1.6499 1.4139 1.4451 1.6914 1.6093 1.3835 1.3438 1.3737 1.3985 1.4411 1.2141 1.2795 1.4761 1.3444 1.4390 1.2947 1.4825 1.5061 1.4559 1.4410 1.4384 1.4572 1.4646 1.4069 1.4486 2.4688 1.0913 1.0890 1.0871 1.1210 1.0945 1.0827 1.0874 1.0922 1.0915 1.0931 1.2194 9.2543 1.0690 1.0819 1.0691 1.0676 1.0722 1.0731 1.0651 1.0639 1.0618 1.0642 1.0651 1.0627 1.0629 1.0830 1.0983 1.0952 1.0978 1.0953 1.0998 1.0927 1.0964 1.0972 1.1008 1.1008
irintensity: 0.6885 3.0891 2.1966 0.7385 2.3754 2.4968 1.0744 7.1082 1.4222 8.8783 3.0645 4.4585 3.1887 1.7976 5.2897 6.9510 2.1628 13.9024 15.1258 11.3386 0.7677 3.0970 2.7069 11.6453 8.0743 0.1825 3.1132 1.3195 0.6287 9.9038 5.9813 2.0882 1.1890 3.2724 20.9579 15.1141 23.8459 14.3002 23.0329 8.2324 5.7340 51.3084 8.8819 5.7244 8.2439 10.0353 4.4704 3.7870 5.3806 2.9638 16.0377 6.4999 10.0060 4.7750 13.3493 6.7259 5.7587 5.4338 2.5035 10.6952 8.6176 1.8036 41.6238 6.0090 1.1152 0.1854 2.5068 31.7081 1.7835 35.0012 7.4250 4.4083 40.4066 40.1974 8.2784 14.8064 13.7399 9.4387 33.8825 4.3111 4.1952 1.4949 1.4585 10.2927 0.9968 3.0771 1.7504 4.1518 3.7841 113.7944 5.4202 2.2320 16.5817 2.8350 9.4921 28.6027 19.5217 9.9351 2.3480 12.5515 158.3292 283.2660 496.3853 43.6924 37.0879 32.9570 7.9160 42.7695 17.2677 4.2471 45.2594 38.2444 42.2959 38.2217 39.2095 2.1644 25.4120 62.0612 38.8010 19.4035 14.6762 19.9174 17.3569 11.1588 0.0891 34.0751
temp: 298.150 k
press: 1.00000 atm
elementType: 8 8 8 7 7 6 6 6 6 6 6 6 6 6 6 6 6 6 6 6 1 1 1 1 1 1 1 1 1 1 1 1 1 1 1 1 1 1 1 1 1 1 1 1
symmnumber: 1
zpe: 997905.6 jmol-1
zpe.correction: 0.380082 hartree
zpe.thermalcorrener: 0.396904 hartree
zpe.thermalcorrenthalpy: 0.397848 hartree
zpe.thermalcorrgfe: 0.337466 hartree
zpe.sumelectzpe: -919.573337 hartree
zpe.sumelectthermal: -919.556516 hartree
zpe.sumelectthermalent: -919.555572 hartree
zpe.sumelectthermalfe: -919.615954 hartree
dipole: -3.5667 5.8411 -5.6408
dipole: 8.8689
quadrupole: -117.0531 -123.5360 -124.3178
quadrupole: 14.8819 7.9165 4.8683
quadrupole: 4.5826 -1.9004 -2.6822 14.8819 7.9165 4.8683
hfenergy: -919.9534195 hartree
pointgroup: C01 [X(C15H24N2O3)]
dipole: -1.4480766 -2.2435417 2.246085 debye
polarizability: 206.328349|2.3467896|182.091977|-8.0298009|0.0108947|137.8335016 unknown
InChI: InChI=1S/C15H24N2O3/c18-13-6-1-5-12-11-4-2-8-17(20)9-3-7-15(19,14(11)17)10-16(12)13/h11-12,14,19H,1-10H2
charge 0 multiplicity 1
44 atoms
O  -0.508772 1.47447 -1.373324
O  -2.498512 -0.189242 -1.517652
O  3.355114 2.133535 -0.353316
N  -2.480064 -0.299337 -0.071437
N  1.793159 0.515003 0.254861
C  -1.040446 -0.066885 0.472806
C  -0.068117 -1.13836 -0.061378
C  -0.569322 1.364346 0.079887
C  1.352115 -0.879256 0.538544
C  0.849387 1.580188 0.642151
C  -0.58243 -2.561998 0.260272
C  -1.536905 2.429082 0.663046
C  -2.968825 -1.697964 0.311831
C  -3.433074 0.746454 0.531402
C  -2.024276 -2.760701 -0.253249
C  -2.978148 2.166883 0.179603
C  2.36331 -1.932623 0.032408
C  3.81802 -1.485745 0.257452
C  3.049538 0.90777 -0.211272
C  4.062896 -0.190095 -0.535473
H  -1.119317 -0.142486 1.578727
H  0.00046 -1.006365 -1.157379
H  1.27027 -0.981517 1.649614
H  1.253953 2.525861 0.244947
H  0.800846 1.656404 1.751119
H  -0.542836 -2.735638 1.358225
H  0.073862 -3.316797 -0.207862
H  -1.197864 3.4229 0.320602
H  -1.496092 2.420967 1.772909
H  -3.979235 -1.783881 -0.120568
H  -3.028654 -1.747785 1.417436
H  -3.458236 0.586918 1.628178
H  -4.421797 0.520681 0.099627
H  -2.049394 -2.681587 -1.354381
H  -2.405746 -3.759754 0.029484
H  -3.68402 2.883698 0.638389
H  -3.034004 2.295805 -0.915342
H  2.202003 -2.105858 -1.050715
H  2.165393 -2.888011 0.550106
H  4.518912 -2.277275 -0.066756
H  4.001428 -1.311255 1.336404
H  -1.299409 0.890892 -1.710103
H  4.008667 -0.3948 -1.623318
H  5.060866 0.238758 -0.343006
