program: Gaussian 09
title: 000285680
version: EM64L-G09RevD.01
frameworkgroup: C1[X(C12H20N2O7S)]
method: RPBEPBE
basis: SDD
operation: Freq
keyword: #p
keyword: freq=noraman
keyword: PBEPBE/SDD
title: #p freq=noraman PBEPBE/SDD
converged: YES YES NO NO
title: Mulliken charges:
elementType: S O O O O O O O N N C C C C C C C C C C C C H H H H H H H H H H H H H H H H H H H H
charge: 0.128532 -0.483243 -0.428601 -0.475863 -0.499508 -0.454501 -0.267075 -0.242503 -0.136233 -0.401858 -0.177538 -0.139876 -0.104309 -0.459113 -0.115176 -0.388719 0.247815 -0.052727 -0.582479 -0.321808 -0.655499 0.146117 0.227730 0.264782 0.264430 0.379857 0.233785 0.246467 0.213836 0.381821 0.345407 0.365522 0.311506 0.304283 0.267882 0.377842 0.359897 0.256428 0.222217 0.235393 0.228956 0.376127
chargesum: 0.00000
title: Mulliken charges with hydrogens summed into heavy atoms:
elementType: S O O O O O O O N N C C C C C C C C C C C C
charge: 0.128532 -0.101422 -0.083194 -0.110341 -0.121666 -0.078374 -0.267075 -0.242503 -0.136233 -0.041962 0.050192 0.124906 0.160121 -0.079256 0.118608 0.071583 0.247815 0.258779 -0.010315 -0.065380 0.031068 0.146117
polarizability: 2.23085788e+02 -2.87623182e+01 1.96928888e+02 -6.78040326e+00 -1.44102755e+01 1.52977474e+02
1716.lowfreq: -10.0184 -2.8828 0.0006 0.0015 0.0017 4.4510 23.3946 28.5971 33.0697
frequency: 23.2246 28.4729 32.9783 39.2202 57.9588 61.3333 72.9562 89.7154 120.4154 135.2134 141.9869 157.7930 173.7107 180.2424 192.6712 195.1952 233.1628 237.0276 257.1915 271.2378 291.5570 295.7449 308.5519 340.1137 359.2290 375.1235 426.7102 447.8202 459.6325 507.0452 517.5061 523.0678 545.3597 551.2740 578.4647 596.3503 604.0009 616.3514 686.4820 699.2184 712.6025 726.3659 740.0259 754.5296 758.6667 776.4043 788.1541 790.7203 807.8153 815.3876 864.7889 883.7611 904.8757 925.5373 943.8326 946.1115 986.3712 992.8328 995.3404 1015.0693 1029.6415 1047.6898 1054.2422 1063.1737 1070.0316 1077.4896 1095.7719 1163.8999 1165.9611 1183.2603 1190.4953 1207.4077 1220.2006 1242.0815 1245.4923 1268.4618 1270.0891 1295.9484 1298.5190 1308.2656 1319.3465 1327.8268 1330.4829 1346.4106 1359.1248 1366.6902 1374.1863 1383.3344 1384.9676 1396.3483 1407.3884 1419.1091 1437.0627 1466.1173 1468.5805 1470.1727 1481.7168 1601.6547 1641.4563 1668.6658 2974.4248 2986.2852 2996.6883 3032.0118 3034.4334 3044.4713 3059.7826 3079.1317 3083.0914 3085.0701 3095.2655 3116.8287 3156.3596 3196.4704 3213.5509 3349.2157 3370.0798 3391.4292 3410.5930 3522.9801
redmass: 5.5565 3.7047 6.0440 4.8907 5.3661 2.3354 6.4062 6.1607 6.9135 6.1350 6.4365 5.3034 7.6392 6.5968 5.5819 5.0490 5.2937 1.1445 5.5175 7.0738 4.3965 4.9003 8.5690 3.7908 5.3212 10.2133 3.8174 4.3462 5.3417 4.1200 5.4754 2.0008 2.0718 1.2363 3.0884 1.1639 4.4870 3.7758 3.1081 3.1088 2.7715 1.3355 6.6931 3.9497 3.2128 2.2066 1.1644 3.0723 4.1741 1.7933 3.9135 1.2642 3.4899 3.0011 3.3093 2.5181 1.3364 3.2467 1.8628 3.5797 3.8903 1.2353 2.5670 2.0770 2.2388 2.1879 2.5163 1.6980 1.2778 1.2150 1.3053 2.5596 1.4961 1.2359 1.3324 1.3379 1.5136 1.2640 1.3118 1.5155 2.2249 1.3284 1.5963 1.2896 1.4198 1.2028 1.2481 1.3779 1.4359 1.2064 1.2004 2.4526 1.4890 1.0792 1.0689 1.0582 1.0486 5.2285 10.9529 5.8851 1.0839 1.0356 1.0655 1.0582 1.0859 1.0850 1.0865 1.0994 1.0851 1.0998 1.1003 1.1086 1.0944 1.0654 1.0962 1.0646 1.0649 1.0642 1.0647 1.0770
irintensity: 0.0943 0.5969 1.3352 1.4163 0.5715 0.2543 4.0116 0.1864 3.4378 8.2950 8.3474 16.2542 4.3022 4.9115 4.8399 7.5745 13.7959 0.0438 9.3328 0.7432 3.0357 19.2706 2.2249 6.5521 4.7373 22.0482 12.9805 40.5615 12.6411 12.5047 4.9776 29.5727 44.3111 212.6420 15.2495 152.6959 28.1033 35.3629 17.3409 13.2922 19.2162 340.3886 0.7255 43.9799 47.9479 64.7076 4.5285 78.8958 4.8676 99.5784 11.2479 35.3003 22.5501 17.3030 18.3487 28.4647 0.4367 35.5584 32.0467 21.5603 16.2032 0.2468 11.0472 104.4766 6.9130 59.1503 21.4881 28.2793 15.2948 38.7245 1.4635 40.3034 68.8444 2.1650 59.4107 14.0758 121.0828 13.6547 50.8749 14.4389 53.8511 12.7180 19.6014 84.9624 46.4932 34.9296 50.5009 42.6443 17.5673 18.9020 84.9139 74.9121 60.0972 6.9395 8.5844 11.6458 8.7306 25.1396 210.0364 833.8368 19.6437 29.7692 36.7271 8.6984 19.8886 14.0042 21.2170 19.0118 7.4072 14.9833 26.9158 17.9197 24.3556 341.1719 0.1288 74.6403 178.2149 33.5384 34.1244 58.1181
temp: 298.150 k
press: 1.00000 atm
elementType: 16 8 8 8 8 8 8 8 7 7 6 6 6 6 6 6 6 6 6 6 6 6 1 1 1 1 1 1 1 1 1 1 1 1 1 1 1 1 1 1 1 1
symmnumber: 1
zpe: 866738.9 jmol-1
zpe.correction: 0.330123 hartree
zpe.thermalcorrener: 0.353477 hartree
zpe.thermalcorrenthalpy: 0.354422 hartree
zpe.thermalcorrgfe: 0.275433 hartree
zpe.sumelectzpe: -1501.689878 hartree
zpe.sumelectthermal: -1501.666524 hartree
zpe.sumelectthermalent: -1501.665580 hartree
zpe.sumelectthermalfe: -1501.744568 hartree
dipole: -5.1106 2.8751 2.2993
dipole: 6.2985
quadrupole: -169.2374 -141.4119 -137.4706
quadrupole: 6.3870 -6.2689 0.4300
quadrupole: -19.8641 7.9614 11.9027 6.3870 -6.2689 0.4300
hfenergy: -1502.0200017 hartree
pointgroup: C01 [X(C12H20N2O7S1)]
dipole: 1.5272071 1.9423212 0.1887005 debye
polarizability: 201.759163|29.556971|191.4119902|7.4581038|35.8663396|179.8209975 unknown
InChI: InChI=1S/C12H20N2O7S/c1-2-22-11(14-4-3-7(17)13-12(14)21)10(20)9(19)8(18)6(16)5-15/h3-4,6,8-11,13,15-16,18-20H,2,5H2,1H3
charge 0 multiplicity 1
42 atoms
S  -1.844688 1.79061 -0.391141
O  1.114781 0.189503 1.549473
O  0.443346 0.612893 -2.098524
O  3.066096 -1.062706 0.13331
O  3.540003 1.257051 1.985107
O  5.539558 -0.344392 1.137119
O  -3.122828 -1.115694 1.287509
O  -4.72051 -3.696572 -2.270727
N  -1.984225 -0.985437 -0.774295
N  -3.866051 -2.403194 -0.521044
C  1.340801 0.687444 0.179592
C  0.335316 -0.005176 -0.766743
C  2.804527 0.357395 -0.210054
C  -1.095476 0.031229 -0.194166
C  3.808206 1.280527 0.521425
C  5.276136 0.842554 0.305026
C  -3.009106 -1.480599 0.085084
C  -1.922631 -1.35485 -2.121595
C  -1.961892 2.257952 1.459199
C  -2.796952 -2.253257 -2.680378
C  -2.618727 3.637012 1.58697
C  -3.858697 -2.859701 -1.880525
H  1.176095 1.785021 0.134138
H  0.64206 -1.056471 -0.918737
H  2.934309 0.450874 -1.30267
H  -1.054139 -0.144605 0.891802
H  3.655234 2.322643 0.185167
H  5.973202 1.615854 0.664764
H  5.472791 0.641632 -0.766307
H  1.843697 0.625633 2.101173
H  0.014913 1.513904 -2.029299
H  2.446112 -1.263426 0.894155
H  -1.128125 -0.870576 -2.697105
H  -2.561343 1.462153 1.929913
H  -0.94018 2.241102 1.872041
H  4.230033 0.630873 2.357416
H  -4.602127 -2.784667 0.082309
H  -2.723492 -2.531303 -3.731869
H  -2.024485 4.422371 1.086362
H  -3.633872 3.639394 1.152756
H  -2.706093 3.906309 2.655809
H  4.903323 -1.046711 0.805861
