program: Gaussian 09
title: 000285758
version: EM64L-G09RevD.01
frameworkgroup: C1[X(C23H25NO6)]
method: RPBEPBE
basis: SDD
operation: Freq
keyword: #p
keyword: freq=noraman
keyword: PBEPBE/SDD
title: #p freq=noraman PBEPBE/SDD
converged: YES YES NO NO
title: Mulliken charges:
elementType: O O O O O O N C C C C C C C C C C C C C C C C C C C C C C C H H H H H H H H H H H H H H H H H H H H H H H H H
charge: -0.326924 -0.304489 -0.319316 -0.296304 -0.297160 -0.280832 -0.265446 -0.053922 0.495173 0.300958 -0.559640 0.199148 -0.444688 0.166439 0.564472 -0.718601 -0.002359 -0.655962 0.222488 -0.508677 -0.672387 0.268414 0.196950 0.205377 -0.531486 -0.526010 -0.206616 -0.530218 -0.529899 -0.677412 0.231456 0.237183 0.233135 0.274145 0.296826 0.261183 0.328220 0.273227 0.229910 0.227409 0.259546 0.258417 0.226835 0.221026 0.228833 0.227364 0.219092 0.252504 0.227337 0.255323 0.224227 0.227215 0.213329 0.227133 0.228053
chargesum: 0.00000
title: Mulliken charges with hydrogens summed into heavy atoms:
elementType: O O O O O O N C C C C C C C C C C C C C C C C C C C C C C C
charge: -0.326924 -0.304489 -0.319316 -0.296304 -0.297160 -0.280832 -0.265446 -0.053922 0.495173 0.300958 -0.091001 0.199148 0.062592 0.166439 0.564472 -0.421774 -0.002359 -0.394779 0.222488 -0.180457 -0.399160 0.268414 0.196950 0.205377 0.185380 0.180268 0.249581 0.168716 0.176865 -0.008897
polarizability: 4.23870972e+02 -2.78178338e+01 3.70845908e+02 -6.64100200e-01 3.17720494e-01 1.57147366e+02
1716.lowfreq: -4.3651 -3.8761 -0.0007 -0.0005 0.0006 2.8684 21.7033 31.7206 40.3568
frequency: 21.6654 31.7085 40.3375 46.3693 55.9321 72.1866 74.4472 78.3915 93.3264 98.5315 101.5325 105.1552 119.9921 141.1512 148.5989 152.1630 157.6247 163.1819 168.4987 172.8504 200.1479 210.7338 221.3521 235.4751 248.3537 257.0559 260.3350 271.7118 301.7689 315.7678 324.6701 331.3544 353.9695 366.9745 379.3627 386.0213 417.9237 451.4154 456.8172 471.5996 483.8323 486.6054 512.7042 544.2351 576.3213 592.5595 609.5526 621.5940 637.8339 680.2053 684.6498 698.4331 712.3855 726.7911 731.2556 748.8372 756.1283 771.3801 801.6480 803.1419 821.1461 842.7972 867.7246 876.2626 895.9742 908.1697 926.0670 928.5407 941.5687 949.8833 958.6510 974.0692 998.7470 1032.4475 1046.6391 1069.9810 1074.7474 1099.7323 1110.0267 1110.6296 1111.6583 1112.5213 1115.4196 1126.3259 1139.4738 1150.5129 1151.1855 1154.6073 1155.1535 1166.0048 1184.8403 1192.1428 1198.3526 1222.4833 1225.1921 1247.4430 1248.6371 1265.9962 1291.8826 1315.7217 1335.5714 1353.3442 1359.5727 1369.9301 1380.0142 1389.2323 1399.2199 1401.8594 1409.5117 1419.5428 1425.0959 1434.4704 1441.5752 1445.3584 1451.5641 1456.6747 1457.5227 1459.4307 1460.5850 1463.6233 1476.8382 1477.3526 1477.4811 1483.4223 1486.0263 1486.2192 1488.5203 1491.2724 1518.0886 1554.1274 1595.9172 1611.7294 1621.4247 1635.5528 2967.2835 2971.9242 2974.2559 2976.1103 2976.7196 2994.4751 2996.9801 3011.5113 3047.0139 3063.3571 3069.0157 3069.4319 3074.3515 3077.0723 3091.2473 3105.5893 3116.9850 3118.6997 3120.6121 3122.0088 3141.4006 3148.6159 3152.0522 3189.8032 3208.2673
redmass: 4.2221 4.0612 3.9134 3.3956 3.4566 3.1407 3.6787 3.6281 2.7516 4.0647 2.9631 3.2460 3.1966 1.8270 2.2619 1.4379 1.3271 1.4109 1.6755 1.4447 4.6892 3.6160 3.8208 4.1162 1.2919 4.0492 4.3592 6.1896 5.5489 5.4333 6.5699 5.8360 4.2082 4.0044 4.3023 4.4264 5.3476 5.8612 4.5512 4.6749 4.3604 5.1878 4.0758 5.4477 5.7553 4.9664 4.9578 4.4636 6.2971 6.0940 7.5130 5.1391 7.1745 5.4106 4.5071 6.1325 3.3883 7.1223 1.1916 3.3568 4.4143 4.3284 1.4942 2.2514 1.7783 5.5423 3.6870 2.2469 3.5905 1.7068 4.7373 3.8139 2.6118 3.0571 3.5408 2.5683 4.7982 3.8234 1.2689 2.1326 1.2479 1.2414 1.2535 3.2870 1.4602 1.3891 1.3527 1.7293 1.4384 2.2643 1.4240 2.0617 1.8088 1.8496 1.7873 2.2708 1.1320 2.2910 4.7434 2.3125 1.4351 6.7564 1.8213 1.6986 3.0433 2.7839 1.8088 1.8263 3.0481 1.4143 1.3707 1.6915 1.5261 1.7607 1.1087 1.0617 1.0574 1.0615 1.1029 1.0409 1.0545 1.0573 1.0581 1.0920 1.0865 1.3036 2.1769 1.0802 6.3066 8.8207 7.5568 7.6068 7.5323 9.6888 1.0312 1.0309 1.0309 1.0354 1.0596 1.0358 1.0695 1.0582 1.0978 1.1033 1.1064 1.1039 1.1029 1.1042 1.0985 1.1029 1.1025 1.1034 1.1029 1.1034 1.0933 1.0922 1.0920 1.0922 1.0905
irintensity: 0.1027 0.6300 0.9880 0.6920 1.9446 1.3619 4.5284 0.5833 3.4293 5.0009 6.1043 6.8262 5.9075 0.4855 1.6739 1.2731 0.6287 2.3484 1.5923 2.7445 0.4815 0.2841 8.0676 9.4760 0.4285 3.4652 1.6264 16.3813 0.8812 9.6471 4.7757 17.8103 5.1479 1.9417 3.5579 2.5538 2.8681 11.5960 3.9811 8.1430 3.0893 2.4463 0.8108 11.3780 4.5913 4.1207 4.5541 16.0863 20.1537 2.0871 6.7389 17.4198 1.7602 36.8666 1.7180 5.2487 0.7452 29.1915 2.6523 3.1671 3.7967 7.8984 0.7154 3.1832 23.4337 7.9520 40.2675 90.3407 68.6100 64.2095 124.7122 26.3413 34.1292 55.9627 168.3718 206.8449 59.0361 136.2093 12.3895 3.8341 17.0517 4.5258 16.7477 123.4460 5.3102 4.8359 0.8875 12.0271 9.2288 53.9130 284.1745 53.4372 133.6416 37.4682 37.8349 25.2541 0.0080 102.9937 48.3398 227.0002 151.9850 35.9598 5.7569 48.5177 26.3934 99.6634 130.0497 47.5545 29.1559 10.0319 45.9121 22.5654 13.2713 56.9753 6.7962 8.9838 16.3495 3.1667 0.0280 12.9985 8.0537 4.3348 2.7566 8.3768 17.0789 18.6982 201.1068 8.8740 6.6309 8.0042 14.4718 224.8321 77.5660 110.8206 89.0541 92.7962 96.9165 58.6509 22.9526 25.3840 33.7508 24.3035 33.8649 29.1910 6.0244 23.8281 22.4225 25.4823 33.0391 46.8404 28.4426 18.5346 31.0053 26.1406 3.2345 5.9067 3.8037 1.0518 19.7732
temp: 298.150 k
press: 1.00000 atm
elementType: 8 8 8 8 8 8 7 6 6 6 6 6 6 6 6 6 6 6 6 6 6 6 6 6 6 6 6 6 6 6 1 1 1 1 1 1 1 1 1 1 1 1 1 1 1 1 1 1 1 1 1 1 1 1 1
symmnumber: 1
zpe: 1144816.4 jmol-1
zpe.correction: 0.436038 hartree
zpe.thermalcorrener: 0.465782 hartree
zpe.thermalcorrenthalpy: 0.466726 hartree
zpe.thermalcorrgfe: 0.374775 hartree
zpe.sumelectzpe: -1395.312156 hartree
zpe.sumelectthermal: -1395.282411 hartree
zpe.sumelectthermalent: -1395.281467 hartree
zpe.sumelectthermalfe: -1395.373418 hartree
dipole: -0.9575 2.0578 -0.8365
dipole: 2.4189
quadrupole: -137.6006 -167.4976 -172.2126
quadrupole: -0.7570 -2.2384 0.6228
quadrupole: 21.5031 -8.3940 -13.1090 -0.7570 -2.2384 0.6228
hfenergy: -1395.7481931 hartree
pointgroup: C01 [X(C23H25N1O6)]
dipole: -0.3740637 0.8106675 -0.329482 debye
polarizability: 423.930919|-27.7544927|370.7607873|2.2766715|1.0362078|157.1725394 unknown
InChI: InChI=1S/C23H25NO6/c1-6-30-23(25)24-8-7-13-10-19(28-4)22(29-5)21-15-12-18(27-3)17(26-2)11-14(15)9-16(24)20(13)21/h9-12H,6-8H2,1-5H3
charge 0 multiplicity 1
55 atoms
O  2.588125 2.485873 0.051965
O  0.983506 4.79402 0.279289
O  -5.157955 -1.11137 -0.181069
O  4.822304 -1.534962 0.244363
O  3.313532 -4.026394 -0.031104
O  -3.386737 -2.455345 0.544175
N  -3.005109 -0.290649 -0.354307
C  -0.890126 0.997094 -0.096431
C  -1.655775 2.210264 -0.020874
C  -1.569095 -0.291928 -0.237746
C  -3.171603 2.147478 -0.089822
C  0.562275 1.038038 -0.024617
C  -3.614498 0.940046 -0.925661
C  1.321579 -0.220985 -0.033449
C  0.591208 -1.46037 -0.164453
C  -0.839508 -1.467288 -0.282468
C  1.176512 2.338599 0.060489
C  -1.01223 3.442272 0.128202
C  0.396883 3.511111 0.182944
C  2.743887 -0.309612 0.098524
C  1.288457 -2.706547 -0.155358
C  -3.789226 -1.372286 0.043386
C  3.412596 -1.5382 0.08912
C  2.675864 -2.764335 -0.018045
C  3.117837 3.109284 -1.185603
C  1.806901 5.024608 1.489925
C  -6.073151 -2.215875 0.225895
C  5.564647 -2.044595 -0.931463
C  4.025968 -4.369556 1.222958
C  -7.489309 -1.74752 -0.094387
H  -3.574165 3.078183 -0.529505
H  -3.600718 2.055237 0.928202
H  -3.266264 1.05286 -1.970907
H  -4.704623 0.822164 -0.926051
H  -1.35232 -2.425611 -0.372496
H  -1.580302 4.375585 0.200573
H  3.335654 0.596746 0.217531
H  0.729597 -3.644703 -0.233072
H  4.2082 3.163757 -1.043016
H  2.881607 2.477066 -2.061896
H  2.694367 4.120628 -1.317785
H  2.638218 4.300516 1.544568
H  2.190281 6.051402 1.388505
H  1.176634 4.945768 2.396014
H  -5.926873 -2.414636 1.3028
H  -5.792966 -3.127714 -0.331644
H  5.398111 -1.38209 -1.802593
H  5.253249 -3.075279 -1.180856
H  6.626574 -2.022057 -0.641876
H  4.779018 -3.600606 1.472124
H  3.301011 -4.469689 2.052906
H  4.509473 -5.339107 1.028662
H  -8.213394 -2.533713 0.187202
H  -7.739063 -0.830061 0.465923
H  -7.603467 -1.541115 -1.172484
